{"text_format":"3","workbook":"xlsx","n_sheets":38,"sheets":["Инструкция","modInstruction","Лог обновления","Контакты","ТС","ГВС","ХВС","ВО","Свод","Результаты загрузки","Проверка","TECHSHEET","TECH_HORISONTAL","modfrmActivity","REESTR_ORG","modGetGeoBase","REESTR_MO","AUTHORISATION","modInfo","modUIButtons","modVLDCommonProv","modVLDIntegrityProv","modVLDProv","modCommonProcedures","modfrmRegion","modVLDProvGeneralProc","modVLDOrgUniqueness","modfrmReestr","modUpdTemplMain","modfrmCheckUpdates","modGeneralProcedures","modRequestSpecificData","modRequestReestrData","modfrmDateChoose","modfrmReportMode","modListOrg","modLoad_Svod","modOpen"],"not_rendered":{"images":29,"macros":1,"defined_names":314,"comments":5},"read":"whole","date_system":"1900"}

{"sheet":"Инструкция","index":0,"n_rows":105,"n_cols":27,"rows_kept":105,"merged":[[1,1,1,6],[2,1,2,2],[4,1,4,24],[6,4,18,23],[20,5,20,12],[20,15,20,23],[21,5,21,12],[21,15,21,23],[34,4,38,23],[40,4,40,16],[40,17,40,24],[45,4,56,23],[58,4,58,9],[58,10,58,23],[59,4,59,9],[59,10,59,23],[75,4,75,6],[75,7,75,23],[76,4,76,9],[76,10,76,23],[77,4,77,9],[77,10,77,23],[78,4,78,9],[78,10,78,23],[92,4,92,23],[94,5,94,18],[96,5,96,23],[102,4,102,16],[102,17,102,24],[103,4,103,16],[103,17,103,24],[104,4,104,16],[104,17,104,24]]}
[{"$nulls":26}," (требуется обновление)"]
[null,{"$f":"\"Код отчёта: \" & GetCode()","v":"Код отчёта: JKH.INF.PODKL.CVSNA.2018"}]
[null,{"$f":"\"Версия \" & GetVersion()","v":"Версия 1.0"}]
[]
[null,"Информация, связанная с установленной платой за подключение к системам коммунальной инфраструктуры регулируемых организаций"]
[]
[{"$nulls":4},"• На рабочем месте должен быть установлен MS Office 2003 SP3, 2007 SP3, 2010, 2013 с полной версией MS Excel\n\n• Макросы во время работы должны быть включены (!)\n\n• Для корректной работы отчёта требуется выбрать низкий уровень безопасности\n(В меню MS Excel 2003: Сервис | Макрос | Безопасность | выбрать пункт «Низкая безопасность» | OK)\n(В меню MS Excel 2007/2010/2013: Параметры Excel | Центр управления безопасностью | Параметры центра управления безопасностью | Параметры макросов | Включить все макросы | ОК)\n\n• Если Вы работаете в табличном процессоре MS Excel 2007 и выше, то можете использовать для работы формат XLSB (Двоичная книга Excel). При работе в формате XLSB заметно быстрее происходит сохранение файла, а также уменьшается размер по сравнению с форматами XLS и XLSM\n\n• Не рекомендуется снимать защиту с листов и каким-либо образом модифицировать защищаемые формулы и расчётные поля, в противном случае, отчёт будет отклонён системой\n\n• При сохранении не следует выбирать формат XLSX (Книга Excel), так как в указанном формате макросы, необходимые для работы отчёта, безвозвратно удаляются"]
{"$rows_empty":13}
[{"$nulls":4},"A"," - предназначенные для заполнения",{"$nulls":8},"A"," - ссылки и автозаполняемые поля"]
[{"$nulls":4},"A"," - с формулами и константами",{"$nulls":8},"A"," - обязательные для заполнения"]
{"$rows_empty":12}
[{"$nulls":4},"Если в предложенном Вам списке необходимая организация, МР/МО отсутствуют, обновите реестры с помощью кнопок на листе \"Список организаций\"\n\nВ результате синхронизации с базой данных список организаций (МР/МО) будет заменён актуальным (механизм синхронизации требует подключения к сети Интернет и основан на использовании протокола HTTPS (TCP порт 443))\n\nЕсли после обновления Вам не удалось найти необходимую организацию в списке, обратитесь к ответственному за поддержание реестра Вашего региона."]
[]
[]
[]
[]
[]
[{"$nulls":4},"Адрес сервера ЕИАС для запроса данных:",{"$nulls":12},"https://eias.ru"]
[]
[]
[]
[]
[{"$nulls":4},"• При сохранении шаблона осуществляется проверка корректности данных, в том числе на наличие значений в ячейках, обязательных для заполнения\n\n• Если какая-то ячейка не удовлетворяет условию проверки, на лист «Проверка» добавляется гиперссылка на данную ячейку и указывается причина ошибки\n\n• В колонке «Статус» для каждого сообщения возможны 2 значения: ошибка и предупреждение\n\n• При наличии сообщений со статусом «Ошибка» шаблон будет отклонён системой и не будет загружен в хранилище данных, сообщения со статусом «Предупреждение» носят информационный характер, и такой шаблон будет принят системой"]
{"$rows_empty":12}
[{"$nulls":4},"Консультации:",{"$nulls":5},"Обратиться за помощью"]
[{"$nulls":4},"Дистрибутивы:",{"$nulls":5},"Перейти"]
{"$rows_empty":16}
[{"$nulls":4},"Сопровождение:",{"$nulls":5},"Обратиться за помощью"]
[{"$nulls":4},"Отчётные формы:",{"$nulls":5},"Перейти к разделу"]
[{"$nulls":4},"Хранилище документов:",{"$nulls":5},"Руководство по загрузке документов"]
{"$rows_empty":13}
[{"$nulls":4},"При наличии подключения к Интернет, можно автоматически проверять наличие доступных обновлений. Выберите способ оповещения о наличии обновлений для отчёта:"]
[]
[{"$nulls":5},"проверять доступные обновления (рекомендуется)",{"$nulls":20},"y"]
[]
[{"$nulls":5},"никогда не проверять наличие обновлений (не рекомендуется)"]
[]
[]
[]
[]
[]
[{"$nulls":4},"Использовать прокси-сервер для запроса обновлений",{"$nulls":12},"нет"]
[{"$nulls":4},"Адрес прокси-сервера"]
[{"$nulls":4},"Порт"]

{"sheet":"modInstruction","index":1,"n_rows":0,"n_cols":0,"rows_kept":0,"hidden":true}

{"sheet":"Лог обновления","index":2,"n_rows":12,"n_cols":4,"rows_kept":12,"hidden":true}
[]
["3/17/2012  12:12:41 AM","Дата/Время","Сообщение","Статус"]
[null,"8/13/2018  3:12:36 PM","Проверка доступных обновлений...","Информация"]
[null,"8/13/2018  3:12:37 PM","Нет доступных обновлений для отчёта с кодом JKH.INF.PODKL.CVSNA.2018!","Информация"]
[null,"8/13/2018  4:09:25 PM","Проверка доступных обновлений...","Информация"]
[null,"8/13/2018  4:09:27 PM","Нет доступных обновлений для отчёта с кодом JKH.INF.PODKL.CVSNA.2018!","Информация"]
[null,"8/13/2018  5:31:19 PM","Проверка доступных обновлений...","Информация"]
[null,"8/13/2018  5:31:21 PM","Нет доступных обновлений для отчёта с кодом JKH.INF.PODKL.CVSNA.2018!","Информация"]
[null,"8/13/2018  6:03:22 PM","Проверка доступных обновлений...","Информация"]
[null,"8/13/2018  6:03:23 PM","Нет доступных обновлений для отчёта с кодом JKH.INF.PODKL.CVSNA.2018!","Информация"]
[null,"8/13/2018  6:15:45 PM","Проверка доступных обновлений...","Информация"]
[null,"8/13/2018  6:15:46 PM","Нет доступных обновлений для отчёта с кодом JKH.INF.PODKL.CVSNA.2018!","Информация"]

{"sheet":"Контакты","index":3,"n_rows":29,"n_cols":10,"rows_kept":29,"merged":[[5,5,5,6],[6,4,6,6],[8,5,8,6],[9,4,9,5],[28,4,28,5]]}
[]
[]
[]
[]
[{"$nulls":6},{"$f":"version","v":"Версия 1.0"}]
[]
[{"$nulls":4},"Контактные данные"]
[]
[]
[{"$nulls":4},"Субъект РФ",null,"Республика Башкортостан",null,null,2018]
[]
[{"$nulls":6},"Региональный орган исполнительной власти в области тарифного регулирования"]
[{"$nulls":5},"Полное название","АО \"Водоснабжающая компания\""]
[{"$nulls":5},"(код) телефон приёмной","8 (3473) 24-01-15"]
[{"$nulls":5},"(код) факс приёмной","8 (3473) 24-01-15"]
[]
[{"$nulls":6},"Ответственный за предоставление информации"]
["L1","Фамилия Имя Отчество",{"$nulls":3},"ФИО","Петрова Любовь Сергеевна"]
["L2","Должность",{"$nulls":3},"Должность"," начальник ПТО"]
["L3","(код) телефон",{"$nulls":3},"(код) телефон","8 (3473) 23-53-82"]
["L4","e-mail",{"$nulls":3},"e-mail","stervod1@mail.ru"]
[]
[{"$nulls":6},"Руководитель"]
[{"$nulls":5},"ФИО","Башкиров Андрей Викторович"]
[{"$nulls":5},"(код) телефон","8 (3473) 24-01-15"]
[]
[{"$nulls":5},"В субъекте РФ нет ни одной организации, для которой утверждена плата за подлючение к системам коммунальной инфраструктуры","нет"]
[]
[{"$nulls":4},"Показывать настройки проверки при сохранении",null,"a"]

{"sheet":"ТС","index":4,"n_rows":17,"n_cols":138,"rows_kept":17,"hidden":true,"merged":[[4,17,4,18],[7,5,10,5],[7,6,10,6],[7,7,10,7],[7,8,10,8],[7,9,10,9],[7,10,10,10],[7,11,10,11],[7,12,10,12],[7,13,10,13],[7,14,10,14],[7,15,10,15],[7,16,10,16],[7,17,10,17],[7,18,10,18],[7,19,10,19],[7,20,10,20],[7,21,10,21],[7,22,10,22],[7,23,10,23],[7,24,10,24],[7,25,10,25],[7,26,10,26],[7,27,10,27],[7,28,10,28],[7,29,10,29],[7,30,10,30],[7,31,10,31],[7,32,10,32],[7,33,10,33],[7,34,10,34],[7,35,7,88],[7,89,7,142],[7,143,8,143],[8,35,10,35],[8,41,8,43],[8,45,10,45],[8,46,10,46],[8,47,8,49],[8,50,10,50],[8,51,8,55],[8,61,10,61],[8,62,8,73],[8,74,10,74],[8,79,8,81],[8,89,10,89],[8,95,8,97],[8,99,8,101],[8,103,10,103],[8,115,10,115],[8,116,8,127],[8,128,10,128],[8,133,8,135],[9,41,10,41],[9,42,10,42],[9,43,10,43],[9,47,10,47],[9,48,10,48],[9,49,10,49],[9,51,10,51],[9,52,9,54],[9,55,10,55],[9,62,9,67],[9,68,9,73],[9,79,10,79],[9,80,10,80],[9,81,10,81],[9,83,10,83],[9,95,10,95],[9,96,10,96],[9,97,10,97],[9,99,10,99],[9,100,10,100],[9,101,10,101],[9,116,9,121],[9,122,9,127],[9,133,10,133],[9,134,10,134],[9,135,10,135],[9,137,10,137],[12,5,12,9],[12,13,12,22]]}
[]
[]
[]
[{"$nulls":5},{"$f":"\"Перечень организаций, оказывающих услуги в сфере \" & R5 & \" по региону: \" & region_name","v":"Перечень организаций, оказывающих услуги в сфере теплоснабжения по региону: Республика Башкортостан"}]
[{"$nulls":13},{"$f":"COUNTIF(E14:E16,\"О\")","v":0},{"$nulls":3},"теплоснабжения"]
[]
[]
[{"$nulls":5},"№ п/п","Муниципальный район","Муниципальное образование","ОКТМО","Тип муниципального образования","MO_DATA_SOURCE",{"$nulls":4},"ИНН","КПП","Наименование юридического лица",null,"Наименование (описание) обособленного подразделения","Вид деятельности организации","RST_ORG_ID","Дополнительные признаки системы коммунальной инфраструктуры",null,"Принцип подключения к системе",{"$nulls":6},"Тип прокладки","Дифференциация трубопроводов сетей по диаметрам, мм","Применены дополнительные параметры дифференциации ",null,{"$f":"\"Фактические данные за \" & god-1 & \" год\"","v":"Фактические данные за 2017 год"},{"$nulls":53},{"$f":"\"Плановые данные на \" & god & \" год\"","v":"Плановые данные на 2018 год"}]
[{"$nulls":35},"Установлена плата за подключение",{"$nulls":5},"Мощность системы коммунальной инфраструктуры, Гкал/ч",{"$nulls":3},"Количество поданных и зарегистрированных заявок на подключение, шт","Необходимая мощность для подключения новых потребителей (согласно поданным заявкам на подключение), Гкал/ч","Количество отказов в подключении, шт",null,null,"Количество выданных условий на подключение, шт","Количество исполненных заявок на подключение, шт",{"$nulls":9},"Плата за подключение объектов менее 0,1 Гкал/ч, руб.","Плата за подключение по диапазонам нагрузки, тыс.руб./Гкал/ч",{"$nulls":11},"Плата за подключение, устанавливаемая в индивидуальном порядке (более 1,5 Гкал/ч при отсутствии технической возможности подключения), тыс.руб.",{"$nulls":4},{"$f":"\"Решение об установлении платы за подключение на \" & god-1 & \" год\"","v":"Решение об установлении платы за подключение на 2017 год"},{"$nulls":3},"Справочно",{"$nulls":5},"Установлена плата за подключение",{"$nulls":5},"Мощность системы коммунальной инфраструктуры, Гкал/ч",{"$nulls":3},"Плановое количество заявок на подключение, шт",{"$nulls":3},"Необходимая мощность для подключения новых потребителей (согласно плановому количеству заявок на подключение), Гкал/ч",{"$nulls":11},"Плата за подключение объектов менее 0,1 Гкал/ч, руб.","Плата за подключение по диапазонам нагрузки, тыс.руб./Гкал/ч",{"$nulls":11},"Плата за подключение, устанавливаемая в индивидуальном порядке (более 1,5 Гкал/ч при отсутствии технической возможности подключения), тыс.руб.",{"$nulls":4},{"$f":"\"Решение об установлении платы за подключение на \" & god & \" год\"","v":"Решение об установлении платы за подключение на 2018 год"},{"$nulls":3},"Справочно"]
[{"$nulls":41},"Установленная (паспортная)","Подключенная к абонентам","Резервная (свободная)",{"$nulls":3},"всего","в связи с недостатком свободной мощности","по другим причинам",null,"всего",{"$f":"\"заявки за \" & god-1 & \" год\"","v":"заявки за 2017 год"},null,null,"заявки, выданные в предыдущие периоды",{"$nulls":6},"от 0,1 Гкал/ч до 1,5 Гкал/ч",{"$nulls":5},"более 1,5 Гкал/ч",{"$nulls":10},"Тип, номер, дата принятия","URL-ссылка","URL-ссылка на экспертное заключение",null,"объём средств для компенсации расходов на выполнение мероприятий, подлежащих осуществлению в ходе подключения объектов заявителей, подключаемая тепловая нагрузка которых не превышает 0,1 Гкал/ч, включенных в состав тарифа на тепловую энергию, передачу тепловой энергии, тыс.руб.",{"$nulls":11},"Установленная (паспортная)","Подключенная к абонентам","Резервная (свободная)",null,"Всего","подключение объектов заявителей, подключаемая тепловая нагрузка которых не превышает 0,1 Гкал/ч","подключение объектов заявителей, подключаемая тепловая нагрузка которых превышает 0,1 Гкал/ч",{"$nulls":14},"от 0,1 Гкал/ч до 1,5 Гкал/ч",{"$nulls":5},"более 1,5 Гкал/ч",{"$nulls":10},"Тип, номер, дата принятия","URL-ссылка","URL-ссылка на экспертное заключение",null,"объём средств для компенсации расходов на выполнение мероприятий, подлежащих осуществлению в ходе подключения объектов заявителей, подключаемая тепловая нагрузка которых не превышает 0,1 Гкал/ч, включенных в состав тарифа на тепловую энергию, передачу тепловой энергии, тыс.руб."]
[{"$nulls":52},"всего","подключение объектов заявителей, подключаемая тепловая нагрузка которых не превышает 0,1 Гкал/ч","подключение объектов заявителей, подключаемая тепловая нагрузка которых превышает 0,1 Гкал/ч",{"$nulls":7},"Плата за подключение установлена по:","Плата за подключение","расходы на проведение мероприятий по подключению объектов заявителей (П1)","расходы на создание (реконструкцию) тепловых сетей (за исключением создания (реконструкции) тепловых пунктов) от существующих тепловых сетей или источников тепловой энергии до точек подключения объектов заявителей (П2.1)","расходы на создание (реконструкцию) тепловых пунктов от существующих тепловых сетей или источников тепловой энергии до точек подключения объектов заявителей (П2.2)","налог на прибыль (Н)","Плата за подключение установлена по:","Плата за подключение","расходы на проведение мероприятий по подключению объектов заявителей (П1)","расходы на создание (реконструкцию) тепловых сетей (за исключением создания (реконструкции) тепловых пунктов) от существующих тепловых сетей или источников тепловой энергии до точек подключения объектов заявителей (П2.1)","расходы на создание (реконструкцию) тепловых пунктов от существующих тепловых сетей или источников тепловой энергии до точек подключения объектов заявителей (П2.2)","налог на прибыль (Н)",{"$nulls":42},"Плата за подключение установлена по:","Плата за подключение","расходы на проведение мероприятий по подключению объектов заявителей (П1)","расходы на создание (реконструкцию) тепловых сетей (за исключением создания (реконструкции) тепловых пунктов) от существующих тепловых сетей или источников тепловой энергии до точек подключения объектов заявителей (П2.1)","расходы на создание (реконструкцию) тепловых пунктов от существующих тепловых сетей или источников тепловой энергии до точек подключения объектов заявителей (П2.2)","налог на прибыль (Н)","Плата за подключение установлена по:","Плата за подключение","расходы на проведение мероприятий по подключению объектов заявителей (П1)","расходы на создание (реконструкцию) тепловых сетей (за исключением создания (реконструкции) тепловых пунктов) от существующих тепловых сетей или источников тепловой энергии до точек подключения объектов заявителей (П2.1)","расходы на создание (реконструкцию) тепловых пунктов от существующих тепловых сетей или источников тепловой энергии до точек подключения объектов заявителей (П2.2)","налог на прибыль (Н)"]
[]
[{"$nulls":5},"Итого по субъекту",{"$nulls":29},{"$f":"COUNTIF(AJ14:AJ16,\"да\")","v":0},{"$nulls":53},{"$f":"COUNTIF(CL14:CL16,\"да\")","v":0}]
[]
[{"$nulls":5},"0"]
[null,null," ",null," ",null,"Добавить"]
[{"$nulls":4},"   "]

{"sheet":"ГВС","index":5,"n_rows":17,"n_cols":136,"rows_kept":17,"hidden":true,"merged":[[4,17,4,18],[7,5,10,5],[7,6,10,6],[7,7,10,7],[7,8,10,8],[7,9,10,9],[7,10,10,10],[7,11,10,11],[7,12,10,12],[7,13,10,13],[7,14,10,14],[7,15,10,15],[7,16,10,16],[7,17,10,17],[7,18,10,18],[7,19,10,19],[7,20,10,20],[7,21,10,21],[7,22,10,22],[7,23,10,23],[7,24,10,24],[7,25,10,25],[7,26,10,26],[7,27,10,27],[7,28,10,28],[7,29,9,30],[7,31,10,31],[7,32,10,32],[7,33,10,33],[7,34,10,34],[7,35,7,88],[7,89,7,142],[7,143,8,143],[8,35,10,35],[8,39,10,39],[8,40,10,40],[8,41,9,42],[8,44,8,46],[8,48,10,48],[8,49,10,49],[8,50,8,52],[8,53,10,53],[8,54,8,56],[8,58,8,62],[8,63,10,63],[8,79,8,81],[8,89,10,89],[8,93,10,93],[8,94,10,94],[8,95,9,96],[8,98,8,100],[8,102,10,102],[8,103,10,103],[8,112,8,116],[8,117,10,117],[8,133,8,135],[9,44,10,44],[9,45,10,45],[9,46,10,46],[9,50,10,50],[9,51,10,51],[9,52,10,52],[9,54,10,54],[9,55,10,55],[9,56,10,56],[9,58,10,58],[9,59,10,59],[9,60,10,60],[9,61,10,61],[9,62,10,62],[9,79,10,79],[9,80,10,80],[9,81,10,81],[9,98,10,98],[9,99,10,99],[9,100,10,100],[9,112,10,112],[9,113,10,113],[9,114,10,114],[9,115,10,115],[9,116,10,116],[9,133,10,133],[9,134,10,134],[9,135,10,135],[12,5,12,9],[12,13,12,22]]}
[]
[]
[]
[{"$nulls":5},{"$f":"\"Перечень организаций, оказывающих услуги в сфере \" & R5 & \" по региону: \" & region_name","v":"Перечень организаций, оказывающих услуги в сфере горячего водоснабжения по региону: Республика Башкортостан"}]
[{"$nulls":13},{"$f":"COUNTIF(E14:E16,\"О\")","v":0},{"$nulls":3},"горячего водоснабжения",null,"ЦГВС"]
[]
[]
[{"$nulls":5},"№ п/п","Муниципальный район","Муниципальное образование","ОКТМО","Тип муниципального образования","MO_DATA_SOURCE",{"$nulls":4},"ИНН","КПП","Наименование юридического лица",null,"Наименование (описание) обособленного подразделения","Вид деятельности организации","RST_ORG_ID","Дополнительные признаки системы коммунальной инфраструктуры",null,"Принцип подключения к системе",null,"Установлены отличные от Основ ценообразования критерии определения платы за подключение в индивидуальном порядке","Установленный предельный уровень нагрузки, при котором плата за подключение определяется в индивидуальном порядке, куб.м/сут","Установленный наружный диаметр создаваемых сетей водоснабжения и (или) водоотведения, при котором плата за подключение определяется в индивидуальном порядке, мм","Реквизиты НПА, которым установлен более низкий (высокий) уровень предельной нагрузки или больший (меньший) диаметр трубопровода",null,null,"Дифференциация трубопроводов сетей по диаметрам, мм","Применены дополнительные параметры дифференциации ",null,{"$f":"\"Фактические данные за \" & god-1 & \" год\"","v":"Фактические данные за 2017 год"},{"$nulls":53},{"$f":"\"Плановые данные на \" & god & \" год\"","v":"Плановые данные на 2018 год"}]
[{"$nulls":35},"Установлена плата за подключение",{"$nulls":3},"Наличие льготной платы за подключение","Значение льготной платы за подключение, тыс.руб.","Реквизиты НПА, которым принято решение об установлении льготной платы за подключение",null,null,"Мощность системы коммунальной инфраструктуры, куб.м/ч",{"$nulls":3},"Количество поданных и зарегистрированных заявок на подключение, шт","Необходимая мощность для подключения новых потребителей (согласно поданным заявкам на подключение), куб.м/сут","Количество отказов в подключении, шт",null,null,"Количество выданных техусловий на подключение, шт","Количество исполненных заявок на подключение, шт",{"$nulls":3},{"$f":"\"Плата за подключение к \" & T5 & \" в общем порядке (в случае несоответствия критериям установления платы за подключение в индивидуальном порядке)\"","v":"Плата за подключение к ЦГВС в общем порядке (в случае несоответствия критериям установления платы за подключение в индивидуальном порядке)"},{"$nulls":4},"Плата за подключение, устанавливаемая в индивидуальном порядке, тыс.руб.",{"$nulls":15},{"$f":"\"Решение об установлении платы за подключение на \" & god-1 & \" год\"","v":"Решение об установлении платы за подключение на 2017 год"},{"$nulls":9},"Установлена плата за подключение",{"$nulls":3},"Наличие льготной платы за подключение","Значение льготной платы за подключение, тыс.руб.","Реквизиты НПА, которым принято решение об установлении льготной платы за подключение",null,null,"Мощность системы коммунальной инфраструктуры, куб.м/ч",{"$nulls":3},"Количество поданных и зарегистрированных заявок на подключение, шт","Необходимая мощность для подключения новых потребителей (согласно поданным заявкам на подключение), куб.м/сут",{"$nulls":8},{"$f":"\"Плата за подключение к \" & BW5 & \" в общем порядке (в случае несоответствия критериям установления платы за подключение в индивидуальном порядке)\"","v":"Плата за подключение к  в общем порядке (в случае несоответствия критериям установления платы за подключение в индивидуальном порядке)"},{"$nulls":4},"Плата за подключение, устанавливаемая в индивидуальном порядке, тыс.руб.",{"$nulls":15},{"$f":"\"Решение об установлении платы за подключение на \" & god & \" год\"","v":"Решение об установлении платы за подключение на 2018 год"}]
[{"$nulls":44},"Установленная (паспортная)","Подключенная к абонентам","Резервная (свободная)",{"$nulls":3},"всего","в связи с недостатком свободной мощности","по другим причинам",null,"всего",{"$f":"\"заявки за \" & god-1 & \" год\"","v":"заявки за 2017 год"},"заявки, выданные в предыдущие периоды",null,"Ставка тарифов за подключаемую нагрузку, тыс.руб./куб.м/сут.","Величина подключаемой нагрузки (мощности) (фактический размер подключенной нагрузки), куб.м/сут.","Ставка тарифов за протяженность сети, тыс.руб./км",null,"Протяженность сети от точки подключения объекта до точки подключения создаваемых сетей, км",{"$nulls":16},"Тип, номер, дата принятия","URL-ссылка","URL-ссылка на экспертное заключение",{"$nulls":16},"Установленная (паспортная)","Подключенная к абонентам","Резервная (свободная)",{"$nulls":11},"Ставка тарифов за подключаемую нагрузку, тыс.руб./куб.м/сут.","Величина подключаемой нагрузки (мощности), куб.м/сут.","Ставка тарифов за протяженность сети, тыс.руб./км",null,"Протяженность сети от точки подключения объекта до точки подключения создаваемых сетей, км",{"$nulls":16},"Тип, номер, дата принятия","URL-ссылка","URL-ссылка на экспертное заключение"]
[{"$nulls":29},"Тип, номер, дата принятия","URL-ссылка",{"$nulls":10},"Тип, номер, дата принятия","URL-ссылка",{"$nulls":52},"Тип, номер, дата принятия","URL-ссылка"]
[]
[{"$nulls":5},"Итого по субъекту",{"$nulls":29},{"$f":"COUNTIF(AJ14:AJ16,\"да\")","v":0},{"$nulls":53},{"$f":"COUNTIF(CL14:CL16,\"да\")","v":0}]
[]
[{"$nulls":5},"0"]
[null,null," ",null," ",null,"Добавить"]
[{"$nulls":4},"   "]

{"sheet":"ХВС","index":6,"n_rows":25,"n_cols":136,"rows_kept":25,"merged":[[4,17,4,18],[7,5,10,5],[7,6,10,6],[7,7,10,7],[7,8,10,8],[7,9,10,9],[7,10,10,10],[7,11,10,11],[7,12,10,12],[7,13,10,13],[7,14,10,14],[7,15,10,15],[7,16,10,16],[7,17,10,17],[7,18,10,18],[7,19,10,19],[7,20,10,20],[7,21,10,21],[7,22,10,22],[7,23,10,23],[7,24,10,24],[7,25,10,25],[7,26,10,26],[7,27,10,27],[7,28,10,28],[7,29,9,30],[7,31,10,31],[7,32,10,32],[7,33,10,33],[7,34,10,34],[7,35,7,88],[7,89,7,142],[7,143,8,143],[8,35,10,35],[8,39,10,39],[8,40,10,40],[8,41,9,42],[8,44,8,46],[8,48,10,48],[8,49,10,49],[8,50,8,52],[8,53,10,53],[8,54,8,56],[8,58,8,62],[8,63,10,63],[8,79,8,81],[8,89,10,89],[8,93,10,93],[8,94,10,94],[8,95,9,96],[8,98,8,100],[8,102,10,102],[8,103,10,103],[8,112,8,116],[8,117,10,117],[8,133,8,135],[9,44,10,44],[9,45,10,45],[9,46,10,46],[9,50,10,50],[9,51,10,51],[9,52,10,52],[9,54,10,54],[9,55,10,55],[9,56,10,56],[9,58,10,58],[9,59,10,59],[9,60,10,60],[9,61,10,61],[9,62,10,62],[9,79,10,79],[9,80,10,80],[9,81,10,81],[9,98,10,98],[9,99,10,99],[9,100,10,100],[9,112,10,112],[9,113,10,113],[9,114,10,114],[9,115,10,115],[9,116,10,116],[9,133,10,133],[9,134,10,134],[9,135,10,135],[12,5,12,9],[12,13,12,22]]}
[]
[]
[]
[{"$nulls":5},{"$f":"\"Перечень организаций, оказывающих услуги в сфере \" & R5 & \" по региону: \" & region_name","v":"Перечень организаций, оказывающих услуги в сфере холодного водоснабжения по региону: Республика Башкортостан"}]
[{"$nulls":13},{"$f":"COUNTIF(E14:E24,\"О\")","v":8},{"$nulls":3},"холодного водоснабжения",null,"ЦХВС"]
[]
[]
[{"$nulls":5},"№ п/п","Муниципальный район","Муниципальное образование","ОКТМО","Тип муниципального образования","MO_DATA_SOURCE",{"$nulls":4},"ИНН","КПП","Наименование юридического лица",null,"Наименование (описание) обособленного подразделения","Вид деятельности организации","RST_ORG_ID","Дополнительные признаки системы коммунальной инфраструктуры",null,"Принцип подключения к системе",null,"Установлены отличные от Основ ценообразования критерии определения платы за подключение в индивидуальном порядке","Установленный предельный уровень нагрузки, при котором плата за подключение определяется в индивидуальном порядке, куб.м/сут","Установленный наружный диаметр создаваемых сетей водоснабжения и (или) водоотведения, при котором плата за подключение определяется в индивидуальном порядке, мм","Реквизиты НПА, которым установлен более низкий (высокий) уровень предельной нагрузки или больший (меньший) диаметр трубопровода",null,null,"Дифференциация трубопроводов сетей по диаметрам, мм","Применены дополнительные параметры дифференциации ",null,{"$f":"\"Фактические данные за \" & god-1 & \" год\"","v":"Фактические данные за 2017 год"},{"$nulls":53},{"$f":"\"Плановые данные на \" & god & \" год\"","v":"Плановые данные на 2018 год"}]
[{"$nulls":35},"Установлена плата за подключение",{"$nulls":3},"Наличие льготной платы за подключение","Значение льготной платы за подключение, тыс.руб.","Реквизиты НПА, которым принято решение об установлении льготной платы за подключение",null,null,"Мощность системы коммунальной инфраструктуры, куб.м/ч",{"$nulls":3},"Количество поданных и зарегистрированных заявок на подключение, шт","Необходимая мощность для подключения новых потребителей (согласно поданным заявкам на подключение), куб.м/сут","Количество отказов в подключении, шт",null,null,"Количество выданных техусловий на подключение, шт","Количество исполненных заявок на подключение, шт",{"$nulls":3},{"$f":"\"Плата за подключение к \" & T5 & \" в общем порядке (в случае несоответствия критериям установления платы за подключение в индивидуальном порядке)\"","v":"Плата за подключение к ЦХВС в общем порядке (в случае несоответствия критериям установления платы за подключение в индивидуальном порядке)"},{"$nulls":4},"Плата за подключение, устанавливаемая в индивидуальном порядке, тыс.руб.",{"$nulls":15},{"$f":"\"Решение об установлении платы за подключение на \" & god-1 & \" год\"","v":"Решение об установлении платы за подключение на 2017 год"},{"$nulls":9},"Установлена плата за подключение",{"$nulls":3},"Наличие льготной платы за подключение","Значение льготной платы за подключение, тыс.руб.","Реквизиты НПА, которым принято решение об установлении льготной платы за подключение",null,null,"Мощность системы коммунальной инфраструктуры, куб.м/ч",{"$nulls":3},"Количество поданных и зарегистрированных заявок на подключение, шт","Необходимая мощность для подключения новых потребителей (согласно поданным заявкам на подключение), куб.м/сут",{"$nulls":8},{"$f":"\"Плата за подключение к \" & BW5 & \" в общем порядке (в случае несоответствия критериям установления платы за подключение в индивидуальном порядке)\"","v":"Плата за подключение к  в общем порядке (в случае несоответствия критериям установления платы за подключение в индивидуальном порядке)"},{"$nulls":4},"Плата за подключение, устанавливаемая в индивидуальном порядке, тыс.руб.",{"$nulls":15},{"$f":"\"Решение об установлении платы за подключение на \" & god & \" год\"","v":"Решение об установлении платы за подключение на 2018 год"}]
[{"$nulls":44},"Установленная (паспортная)","Подключенная к абонентам","Резервная (свободная)",{"$nulls":3},"всего","в связи с недостатком свободной мощности","по другим причинам",null,"всего",{"$f":"\"заявки за \" & god-1 & \" год\"","v":"заявки за 2017 год"},"заявки, выданные в предыдущие периоды",null,"Ставка тарифов за подключаемую нагрузку, тыс.руб./куб.м/сут.","Величина подключаемой нагрузки (мощности) (фактический размер подключенной нагрузки), куб.м/сут.","Ставка тарифов за протяженность сети, тыс.руб./км",null,"Протяженность сети от точки подключения объекта до точки подключения создаваемых сетей, км",{"$nulls":16},"Тип, номер, дата принятия","URL-ссылка","URL-ссылка на экспертное заключение",{"$nulls":16},"Установленная (паспортная)","Подключенная к абонентам","Резервная (свободная)",{"$nulls":11},"Ставка тарифов за подключаемую нагрузку, тыс.руб./куб.м/сут.","Величина подключаемой нагрузки (мощности), куб.м/сут.","Ставка тарифов за протяженность сети, тыс.руб./км",null,"Протяженность сети от точки подключения объекта до точки подключения создаваемых сетей, км",{"$nulls":16},"Тип, номер, дата принятия","URL-ссылка","URL-ссылка на экспертное заключение"]
[{"$nulls":29},"Тип, номер, дата принятия","URL-ссылка",{"$nulls":10},"Тип, номер, дата принятия","URL-ссылка",{"$nulls":52},"Тип, номер, дата принятия","URL-ссылка"]
[]
[{"$nulls":5},"Итого по субъекту",{"$nulls":29},{"$f":"COUNTIF(AJ14:AJ24,\"да\")","v":3},{"$nulls":53},{"$f":"COUNTIF(CL14:CL24,\"да\")","v":8}]
[]
[{"$nulls":5},"0"]
[{"$nulls":4},"О","1","Город Стерлитамак","Город Стерлитамак","80745000",{"$f":"IF(LEN(I16)=0,\"\",VLOOKUP(I16,OKTMO_VS_TYPE_LIST,2,FALSE))","v":"городской округ"},null,null,"Изменить",null,null,"0268055772","026801001","ЗАО \"Водоснабжающая компания\"",null,null,"Производство (подъём / добыча) воды :: Очистка воды :: Транспортировка воды :: Сбыт (распределение) воды","26758634","мкрн 2 Западного района",null,"Подключение к ЦХВС в индивидуальном порядке",null,"нет",{"$nulls":5},"без дифференциации","нет",null,"да",{"$nulls":3},"нет",{"$nulls":4},112.23,{"v":52.805,"d":"52.81"},{"v":59.425,"d":"59.43"},null,6,{"v":14,"d":"14.00"},{"$f":"AZ16+BA16","v":0},0,0,6,{"$f":"BD16+BE16","v":5},3,2,{"$nulls":6},174.94,{"$nulls":15},"Постановление № 82 от 06.04.2015 г.","https://portal.eias.ru/Portal/DownloadPage.aspx?type=12&guid=1b424632-5fe0-4ba6-a6b5-9c5cc19f9d08","https://portal.eias.ru/Portal/DownloadPage.aspx?type=12&guid=1b424632-5fe0-4ba6-a6b5-9c5cc19f9d08",{"$nulls":7},"да",{"$nulls":3},"нет",{"$nulls":4},112.23,52.81,{"v":45.425,"d":"45.43"},null,0,{"v":0,"d":"0.00"},{"$nulls":13},174.94,{"$nulls":15},"Постановление № 9 от 29.01.18 г.","https://portal.eias.ru/Portal/DownloadPage.aspx?type=12&guid=d9c994ea-2b5e-44d7-bd98-e9a6357ff15d","https://portal.eias.ru/Portal/DownloadPage.aspx?type=12&guid=d9c994ea-2b5e-44d7-bd98-e9a6357ff15d"]
[{"$nulls":4},"О","2","Город Стерлитамак","Город Стерлитамак","80745000","городской округ",null,null,"Изменить",null,null,"0268055772","026801001","ЗАО \"Водоснабжающая компания\"",null,null,"Производство (подъём / добыча) воды :: Очистка воды :: Транспортировка воды :: Сбыт (распределение) воды","26758634","мкрн 5 Западного района",null,"Подключение к ЦХВС в индивидуальном порядке",null,"нет",{"$nulls":5},"без дифференциации","нет",null,"да",{"$nulls":3},"нет",{"$nulls":4},{"v":99.2,"d":"99.20"},{"v":29.8,"d":"29.80"},{"v":69.4,"d":"69.40"},null,5,{"v":66,"d":"66.00"},{"$f":"AZ17+BA17","v":0},0,0,5,{"$f":"BD17+BE17","v":5},1,4,{"$nulls":6},310.91,{"$nulls":15},"Постановление № 78 от 06.04.2015 г.","https://portal.eias.ru/Portal/DownloadPage.aspx?type=12&guid=36b33ce7-5a69-4721-911d-ad66118f3e48","https://portal.eias.ru/Portal/DownloadPage.aspx?type=12&guid=1b424632-5fe0-4ba6-a6b5-9c5cc19f9d08",{"$nulls":7},"да",{"$nulls":3},"нет",{"$nulls":4},{"v":99.2,"d":"99.20"},{"v":29.8,"d":"29.80"},{"v":33.2,"d":"33.20"},null,0,{"v":0,"d":"0.00"},{"$nulls":13},310.91,{"$nulls":15},"Постановление № 5 от 29.01.18 г.","https://portal.eias.ru/Portal/DownloadPage.aspx?type=12&guid=99289d12-b2b8-481f-bf58-c36579c39911","https://portal.eias.ru/Portal/DownloadPage.aspx?type=12&guid=99289d12-b2b8-481f-bf58-c36579c39911"]
[{"$nulls":4},"О","3","Город Стерлитамак","Город Стерлитамак","80745000","городской округ",null,null,"Изменить",null,null,"0268055772","026801001","ЗАО \"Водоснабжающая компания\"",null,null,"Производство (подъём / добыча) воды :: Очистка воды :: Транспортировка воды :: Сбыт (распределение) воды","26758634","мкрн 4А Западного района",null,"Подключение к ЦХВС в индивидуальном порядке",null,"нет",{"$nulls":5},"без дифференциации","нет",null,"да",{"$nulls":3},"нет",{"$nulls":4},81.92,{"v":0,"d":"0.00"},26.45,null,0,{"v":0,"d":"0.00"},{"$f":"AZ18+BA18","v":0},0,0,0,{"$f":"BD18+BE18","v":5},0,5,{"$nulls":6},114.32,{"$nulls":15},"Постановление № 80 от 06.04.2015 г.","https://portal.eias.ru/Portal/DownloadPage.aspx?type=12&guid=1b4a5c72-96d3-4df8-a988-bf8bd32b9542","https://portal.eias.ru/Portal/DownloadPage.aspx?type=12&guid=1b424632-5fe0-4ba6-a6b5-9c5cc19f9d08",{"$nulls":7},"да",{"$nulls":3},"нет",{"$nulls":4},81.92,51.76,26.45,null,0,{"v":0,"d":"0.00"},{"$nulls":13},114.32,{"$nulls":15},"Постановление № 7 от 29.01.18 г.","https://portal.eias.ru/Portal/DownloadPage.aspx?type=12&guid=0a49eca5-48ae-4128-9b43-53481314958a","https://portal.eias.ru/Portal/DownloadPage.aspx?type=12&guid=0a49eca5-48ae-4128-9b43-53481314958a"]
[{"$nulls":4},"О","4","Город Стерлитамак","Город Стерлитамак","80745000","городской округ",null,null,"Изменить",null,null,"0268055772","026801001","ЗАО \"Водоснабжающая компания\"",null,null,"Производство (подъём / добыча) воды :: Очистка воды :: Транспортировка воды :: Сбыт (распределение) воды","26758634","ИП 2017-2019гг",null,"Подключение к ЦХВС в общем порядке (в случае несоответствия критериям установления платы за подключение в индивидуальном порядке)",null,"нет",{"$nulls":5},"70 - 100 мм","нет",null,"нет",{"$nulls":53},"да",{"$nulls":3},"нет",{"$nulls":4},{"v":0,"d":"0.00"},{"v":0,"d":"0.00"},{"v":0,"d":"0.00"},null,0,{"v":0,"d":"0.00"},{"$nulls":8},{"v":0,"d":"0.00"},{"v":0,"d":"0.00"},0.26,null,{"v":0,"d":"0.00"},{"$nulls":16},"Постановление № 394 от 05.12.16 г.","https://portal.eias.ru/Portal/DownloadPage.aspx?type=12&guid=0409775c-a8ba-4d53-974f-c66f8b12a8ef","https://portal.eias.ru/Portal/DownloadPage.aspx?type=12&guid=0409775c-a8ba-4d53-974f-c66f8b12a8ef"]
[{"$nulls":4},"О","5","Город Стерлитамак","Город Стерлитамак","80745000","городской округ",null,null,"Изменить",null,null,"0268055772","026801001","ЗАО \"Водоснабжающая компания\"",null,null,"Производство (подъём / добыча) воды :: Очистка воды :: Транспортировка воды :: Сбыт (распределение) воды","26758634","ИП 2017-2019гг",null,"Подключение к ЦХВС в общем порядке (в случае несоответствия критериям установления платы за подключение в индивидуальном порядке)",null,"нет",{"$nulls":5},"100 - 150 мм","нет",null,"нет",{"$nulls":53},"да",{"$nulls":3},"нет",{"$nulls":4},{"v":0,"d":"0.00"},{"v":0,"d":"0.00"},{"v":0,"d":"0.00"},null,0,{"v":0,"d":"0.00"},{"$nulls":8},{"v":0,"d":"0.00"},{"v":0,"d":"0.00"},0.32,null,{"v":0,"d":"0.00"},{"$nulls":16},"Постановление № 394 от 05.12.16 г.","https://portal.eias.ru/Portal/DownloadPage.aspx?type=12&guid=0409775c-a8ba-4d53-974f-c66f8b12a8ef","https://portal.eias.ru/Portal/DownloadPage.aspx?type=12&guid=0409775c-a8ba-4d53-974f-c66f8b12a8ef"]
[{"$nulls":4},"О","6","Город Стерлитамак","Город Стерлитамак","80745000","городской округ",null,null,"Изменить",null,null,"0268055772","026801001","ЗАО \"Водоснабжающая компания\"",null,null,"Производство (подъём / добыча) воды :: Очистка воды :: Транспортировка воды :: Сбыт (распределение) воды","26758634","ИП 2017-2019гг",null,"Подключение к ЦХВС в общем порядке (в случае несоответствия критериям установления платы за подключение в индивидуальном порядке)",null,"нет",{"$nulls":5},"150 - 200 мм","нет",null,"нет",{"$nulls":53},"да",{"$nulls":3},"нет",{"$nulls":4},{"v":0,"d":"0.00"},{"v":0,"d":"0.00"},{"v":0,"d":"0.00"},null,0,{"v":0,"d":"0.00"},{"$nulls":8},{"v":0,"d":"0.00"},{"v":0,"d":"0.00"},{"v":0.4,"d":"0.40"},null,{"v":0,"d":"0.00"},{"$nulls":16},"Постановление № 394 от 05.12.16 г.","https://portal.eias.ru/Portal/DownloadPage.aspx?type=12&guid=0409775c-a8ba-4d53-974f-c66f8b12a8ef","https://portal.eias.ru/Portal/DownloadPage.aspx?type=12&guid=0409775c-a8ba-4d53-974f-c66f8b12a8ef"]
[{"$nulls":4},"О","7","Город Стерлитамак","Город Стерлитамак","80745000","городской округ",null,null,"Изменить",null,null,"0268055772","026801001","ЗАО \"Водоснабжающая компания\"",null,null,"Производство (подъём / добыча) воды :: Очистка воды :: Транспортировка воды :: Сбыт (распределение) воды","26758634","ИП 2017-2019гг",null,"Подключение к ЦХВС в общем порядке (в случае несоответствия критериям установления платы за подключение в индивидуальном порядке)",null,"нет",{"$nulls":5},"200 - 250 мм","нет",null,"нет",{"$nulls":53},"да",{"$nulls":3},"нет",{"$nulls":4},{"v":0,"d":"0.00"},{"v":0,"d":"0.00"},{"v":0,"d":"0.00"},null,0,{"v":0,"d":"0.00"},{"$nulls":8},{"v":0,"d":"0.00"},{"v":0,"d":"0.00"},0.48,null,{"v":0,"d":"0.00"},{"$nulls":16},"Постановление № 394 от 05.12.16 г.","https://portal.eias.ru/Portal/DownloadPage.aspx?type=12&guid=0409775c-a8ba-4d53-974f-c66f8b12a8ef","https://portal.eias.ru/Portal/DownloadPage.aspx?type=12&guid=0409775c-a8ba-4d53-974f-c66f8b12a8ef"]
[{"$nulls":4},"О","8","Город Стерлитамак","Город Стерлитамак","80745000","городской округ",null,null,"Изменить",null,null,"0268055772","026801001","ЗАО \"Водоснабжающая компания\"",null,null,"Производство (подъём / добыча) воды :: Очистка воды :: Транспортировка воды :: Сбыт (распределение) воды","26758634","ИП 2017-2019гг",null,"Подключение к ЦХВС в общем порядке (в случае несоответствия критериям установления платы за подключение в индивидуальном порядке)",null,"нет",{"$nulls":5},"250 мм и более","нет",null,"нет",{"$nulls":53},"да",{"$nulls":3},"нет",{"$nulls":4},{"v":0,"d":"0.00"},{"v":0,"d":"0.00"},{"v":0,"d":"0.00"},null,0,{"v":0,"d":"0.00"},{"$nulls":8},{"v":0,"d":"0.00"},{"v":0,"d":"0.00"},0.57,null,{"v":0,"d":"0.00"},{"$nulls":16},"Постановление № 394 от 05.12.16 г.","https://portal.eias.ru/Portal/DownloadPage.aspx?type=12&guid=0409775c-a8ba-4d53-974f-c66f8b12a8ef","https://portal.eias.ru/Portal/DownloadPage.aspx?type=12&guid=0409775c-a8ba-4d53-974f-c66f8b12a8ef"]
[null,null," ",null," ",null,"Добавить"]
[{"$nulls":4},"   "]

{"sheet":"ВО","index":7,"n_rows":17,"n_cols":136,"rows_kept":17,"hidden":true,"merged":[[4,17,4,18],[7,5,10,5],[7,6,10,6],[7,7,10,7],[7,8,10,8],[7,9,10,9],[7,10,10,10],[7,11,10,11],[7,12,10,12],[7,13,10,13],[7,14,10,14],[7,15,10,15],[7,16,10,16],[7,17,10,17],[7,18,10,18],[7,19,10,19],[7,20,10,20],[7,21,10,21],[7,22,10,22],[7,23,10,23],[7,24,10,24],[7,25,10,25],[7,26,10,26],[7,27,10,27],[7,28,10,28],[7,29,9,30],[7,31,10,31],[7,32,10,32],[7,33,10,33],[7,34,10,34],[7,35,7,88],[7,89,7,142],[7,143,8,143],[8,35,10,35],[8,39,10,39],[8,40,10,40],[8,41,9,42],[8,44,8,46],[8,48,10,48],[8,49,10,49],[8,50,8,52],[8,53,10,53],[8,54,8,56],[8,58,8,62],[8,63,10,63],[8,79,8,81],[8,89,10,89],[8,93,10,93],[8,94,10,94],[8,95,9,96],[8,98,8,100],[8,102,10,102],[8,103,10,103],[8,112,8,116],[8,117,10,117],[8,133,8,135],[9,44,10,44],[9,45,10,45],[9,46,10,46],[9,50,10,50],[9,51,10,51],[9,52,10,52],[9,54,10,54],[9,55,10,55],[9,56,10,56],[9,58,10,58],[9,59,10,59],[9,60,10,60],[9,61,10,61],[9,62,10,62],[9,79,10,79],[9,80,10,80],[9,81,10,81],[9,98,10,98],[9,99,10,99],[9,100,10,100],[9,112,10,112],[9,113,10,113],[9,114,10,114],[9,115,10,115],[9,116,10,116],[9,133,10,133],[9,134,10,134],[9,135,10,135],[12,5,12,9],[12,13,12,22]]}
[]
[]
[]
[{"$nulls":5},{"$f":"\"Перечень организаций, оказывающих услуги в сфере \" & R5 & \" по региону: \" & region_name","v":"Перечень организаций, оказывающих услуги в сфере водоотведения по региону: Республика Башкортостан"}]
[{"$nulls":13},{"$f":"COUNTIF(E14:E16,\"О\")","v":0},{"$nulls":3},"водоотведения",null,"ЦСВО"]
[]
[]
[{"$nulls":5},"№ п/п","Муниципальный район","Муниципальное образование","ОКТМО","Тип муниципального образования","MO_DATA_SOURCE",{"$nulls":4},"ИНН","КПП","Наименование юридического лица",null,"Наименование (описание) обособленного подразделения","Вид деятельности организации","RST_ORG_ID","Дополнительные признаки системы коммунальной инфраструктуры",null,"Принцип подключения к системе",null,"Установлены отличные от Основ ценообразования критерии определения платы за подключение в индивидуальном порядке","Установленный предельный уровень нагрузки, при котором плата за подключение определяется в индивидуальном порядке, куб.м/сут","Установленный наружный диаметр создаваемых сетей водоснабжения и (или) водоотведения, при котором плата за подключение определяется в индивидуальном порядке, мм","Реквизиты НПА, которым установлен более низкий (высокий) уровень предельной нагрузки или больший (меньший) диаметр трубопровода",null,null,"Дифференциация трубопроводов сетей по диаметрам, мм","Применены дополнительные параметры дифференциации ",null,{"$f":"\"Фактические данные за \" & god-1 & \" год\"","v":"Фактические данные за 2017 год"},{"$nulls":53},{"$f":"\"Плановые данные на \" & god & \" год\"","v":"Плановые данные на 2018 год"}]
[{"$nulls":35},"Установлена плата за подключение",{"$nulls":3},"Наличие льготной платы за подключение","Значение льготной платы за подключение, тыс.руб.","Реквизиты НПА, которым принято решение об установлении льготной платы за подключение",null,null,"Мощность системы коммунальной инфраструктуры, куб.м/ч",{"$nulls":3},"Количество поданных и зарегистрированных заявок на подключение, шт","Необходимая мощность для подключения новых потребителей (согласно поданным заявкам на подключение), куб.м/сут","Количество отказов в подключении, шт",null,null,"Количество выданных техусловий на подключение, шт","Количество исполненных заявок на подключение, шт",{"$nulls":3},{"$f":"\"Плата за подключение к \" & T5 & \" в общем порядке (в случае несоответствия критериям установления платы за подключение в индивидуальном порядке)\"","v":"Плата за подключение к ЦСВО в общем порядке (в случае несоответствия критериям установления платы за подключение в индивидуальном порядке)"},{"$nulls":4},"Плата за подключение, устанавливаемая в индивидуальном порядке, тыс.руб.",{"$nulls":15},{"$f":"\"Решение об установлении платы за подключение на \" & god-1 & \" год\"","v":"Решение об установлении платы за подключение на 2017 год"},{"$nulls":9},"Установлена плата за подключение",{"$nulls":3},"Наличие льготной платы за подключение","Значение льготной платы за подключение, тыс.руб.","Реквизиты НПА, которым принято решение об установлении льготной платы за подключение",null,null,"Мощность системы коммунальной инфраструктуры, куб.м/ч",{"$nulls":3},"Количество поданных и зарегистрированных заявок на подключение, шт","Необходимая мощность для подключения новых потребителей (согласно поданным заявкам на подключение), куб.м/сут",{"$nulls":8},{"$f":"\"Плата за подключение к \" & BW5 & \" в общем порядке (в случае несоответствия критериям установления платы за подключение в индивидуальном порядке)\"","v":"Плата за подключение к  в общем порядке (в случае несоответствия критериям установления платы за подключение в индивидуальном порядке)"},{"$nulls":4},"Плата за подключение, устанавливаемая в индивидуальном порядке, тыс.руб.",{"$nulls":15},{"$f":"\"Решение об установлении платы за подключение на \" & god & \" год\"","v":"Решение об установлении платы за подключение на 2018 год"}]
[{"$nulls":44},"Установленная (паспортная)","Подключенная к абонентам","Резервная (свободная)",{"$nulls":3},"всего","в связи с недостатком свободной мощности","по другим причинам",null,"всего",{"$f":"\"заявки за \" & god-1 & \" год\"","v":"заявки за 2017 год"},"заявки, выданные в предыдущие периоды",null,"Ставка тарифов за подключаемую нагрузку, тыс.руб./куб.м/сут.","Величина подключаемой нагрузки (мощности) (фактический размер подключенной нагрузки), куб.м/сут.","Ставка тарифов за протяженность сети, тыс.руб./км",null,"Протяженность сети от точки подключения объекта до точки подключения создаваемых сетей, км",{"$nulls":16},"Тип, номер, дата принятия","URL-ссылка","URL-ссылка на экспертное заключение",{"$nulls":16},"Установленная (паспортная)","Подключенная к абонентам","Резервная (свободная)",{"$nulls":11},"Ставка тарифов за подключаемую нагрузку, тыс.руб./куб.м/сут.","Величина подключаемой нагрузки (мощности), куб.м/сут.","Ставка тарифов за протяженность сети, тыс.руб./км",null,"Протяженность сети от точки подключения объекта до точки подключения создаваемых сетей, км",{"$nulls":16},"Тип, номер, дата принятия","URL-ссылка","URL-ссылка на экспертное заключение"]
[{"$nulls":29},"Тип, номер, дата принятия","URL-ссылка",{"$nulls":10},"Тип, номер, дата принятия","URL-ссылка",{"$nulls":52},"Тип, номер, дата принятия","URL-ссылка"]
[]
[{"$nulls":5},"Итого по субъекту",{"$nulls":29},{"$f":"COUNTIF(AJ14:AJ16,\"да\")","v":0},{"$nulls":53},{"$f":"COUNTIF(CL14:CL16,\"да\")","v":0}]
[]
[{"$nulls":5},"0"]
[null,null," ",null," ",null,"Добавить"]
[{"$nulls":4},"   "]

{"sheet":"Свод","index":8,"n_rows":32,"n_cols":10,"rows_kept":32,"merged":[[2,5,2,6],[3,1,3,6],[5,1,5,6],[7,2,7,6],[9,2,9,6],[12,1,12,6],[13,1,13,6],[14,1,14,6],[15,1,15,6],[16,1,16,6],[17,1,17,6],[18,1,18,6],[19,1,19,6],[20,1,20,6],[21,1,21,6],[22,1,22,6],[23,1,23,6],[24,1,24,6],[25,1,25,6],[26,1,26,6],[27,1,27,6],[28,1,28,6],[29,1,29,6],[30,1,30,6],[31,1,31,6]]}
[]
[{"$nulls":6},{"$f":"version","v":"Версия 1.0"}]
[]
[null,"Свод отчётов от организаций"]
[]
[]
[]
[null,{"$f":"\"Укажите, путь до папки в которой размещены отчёты с кодом \" & GetTemplateCode()","v":"Укажите, путь до папки в которой размещены отчёты с кодом JKH.INF.PODKL.CVSNA.2018"}]
[]
[null,"Выберите отчёт из списка файлов указанной папки"]
[]
[]
[null,"Инструкция по своду данных"]
[]
[null,"Для того чтобы добавить в отчёт данные из других файлов:"]
[null,"1) Поместите отчёты, данные из которых необходимо добавить, в одну папку. Наименование этой папки необходимо указать в ячейке «C8»: либо вручную, либо с помощью кнопки «Обзор папок…»",{"$nulls":7}," "]
[null,"2) Нажмите кнопку «Выгрузить данные из папки»"]
[]
[null,"Для того чтобы добавить в отчёт данные из одного файла:"]
[null,"1) Укажите в ячейке «C8» путь к папке, в которой находится добавляемый файл"]
[null,"2) Нажмите кнопку «Сформировать список файлов папки»"]
[null,"3) В ячейке «C10» выберите из предложенного списка имя файла"]
[null,"4) Нажмите кнопку «Добавить данные из файла»"]
[]
[null,"Примечания"]
[null,"При запуске функции «Выгрузить данные из всех файлов данной папки» появляется окно «Замена совпадений» с вопросом: «При полном совпадении реквизитов организаций из обрабатываемого отчёта с реквизитами организаций уже присутствующими в данном отчёте, перегружать данные об организациях в данный отчёт?»."]
[null,"Варианты ответа:"]
[null,"-         «Всегда заменять» - при совпадении реквизитов данные организаций будут заменяться данными из добавляемого отчёта без подтверждений"]
[null,"-         «Спрашивать о замене» - при совпадении реквизитов данные организаций будут заменяться данными из добавляемого отчёта, только если вы подтвердите это в окне «Замена совпадений»"]
[null,"-         «Пропускать» - при совпадении реквизитов данные организаций не будут заменяться данными из добавляемого отчёта"]
[]
[null,"Лист  «Результаты загрузки» - лист для отображения результатов (ошибок и предупреждений) при переносе данных из других отчётов данного региона."]

{"sheet":"Результаты загрузки","index":9,"n_rows":1,"n_cols":2,"rows_kept":1}
["Файл (для просмотра щелкните по гиперссылке)","Статус"]

{"sheet":"Проверка","index":10,"n_rows":11,"n_cols":8,"rows_kept":11,"merged":[[8,4,8,7]]}
{"$rows_empty":8}
[{"$nulls":4},"Результаты проверки"]
[]
[{"$nulls":4},"Ссылка 1","Ссылка 2","Описание причины","Обязательность выполнения"]

{"sheet":"TECHSHEET","index":11,"n_rows":988,"n_cols":20,"rows_kept":988,"hidden":true}
["Алтайский край","RU22","Алтайский край",{"$nulls":3},"YES_NO",{"$nulls":3},"PROTECT_MARKER",null,"DNS",null,null,"yukuznetsov_ftci","LOGIN",null,"YEAR_LIST","MONTH_LIST"]
["Амурская область","RU28","Амурская область",{"$nulls":3},"да",{"$nulls":3},"FEDERAL.2018",null,{"$f":"USE_DNS_SERVICE","v":"https://eias.ru"},{"$nulls":3},"PASSWORD",null,2009,"Январь"]
["Архангельская область","RU29","Архангельская область",{"$nulls":3},"нет",{"$nulls":8},"MD5","ATH_SCHEME",null,2010,"Февраль"]
["Астраханская область","RU30","Астраханская область",{"$nulls":9},"NDS",null,null,"YES","RETAIN_PASSWORD",null,2011,"Март"]
["Белгородская область","RU31","Белгородская область",{"$nulls":3},"TEMPLATE_SPHERE",{"$nulls":5},1.18,{"$nulls":5},2012,"Апрель"]
["Брянская область","RU32","Брянская область",{"$nulls":3},"холодного водоснабжения",{"$nulls":11},2013,"Май"]
["Владимирская область","RU33","Владимирская область",{"$nulls":9},"PERIOD",null,null,"XML_ORG_LIST_TAG_NAMES",null,null,2014,"Июнь"]
["Волгоградская область","RU34","Волгоградская область",{"$nulls":9},{"$f":"god","v":2018},null,null,"REGION_NAME",null,null,2015,"Июль"]
["Вологодская область","RU35","Вологодская область",{"$nulls":12},"MR_NAME",null,null,2016,"Август"]
["Воронежская область","RU36","Воронежская область",{"$nulls":9},"Организация",null,null,"OKTMR_NAME",null,null,2017,"Сентябрь"]
["г. Москва","RU77","Москва",{"$nulls":9},{"$f":"\"01.01.\" & PERIOD-1","v":"01.01.2017"},null,null,"MO_NAME",null,null,2018,"Октябрь"]
["г. Байконур","RU00",{"$nulls":4},"TEMPLATE_SPHERE_OKK_SOURCE",{"$nulls":5},{"$f":"\"31.12.\" & PERIOD","v":"31.12.2018"},null,null,"OKTMO_NAME",null,null,2019,"Ноябрь"]
["г. Санкт-Петербург","RU78","Cанкт-Петербург",{"$nulls":12},"RST_ORG_ID",null,null,2020,"Декабрь"]
["г. Севастополь","RU92","Севастополь",{"$nulls":9},"Виды деятельности",null,null,"ORG_NAME"]
["Еврейская автономная область","RU79","Еврейская автономная область",{"$nulls":9},{"$f":"\"01.01.\" & PERIOD-1","v":"01.01.2017"},null,null,"INN_NAME"]
["Забайкальский край","RU75","Забайкальский край",{"$nulls":9},{"$f":"\"31.12.\" & PERIOD","v":"31.12.2018"},null,null,"KPP_NAME"]
["Ивановская область","RU37","Ивановская область",{"$nulls":12},"VDET_NAME"]
["Иркутская область","RU38","Иркутская область",{"$nulls":12},"VDET_NAME_LIST"]
["Кабардино-Балкарская республика","RU07","Республика Кабардино-Балкария",{"$nulls":3},"CALC_IDENTIFIER",{"$nulls":8},"VDET_FULL_NAME_LIST"]
["Калининградская область","RU39","Калининградская область",{"$nulls":12},"ORG_START_DATE"]
["Калужская область","RU40","Калужская область",{"$nulls":12},"ORG_END_DATE"]
["Камчатский край","RU41","Камчатский край",{"$nulls":12},"VDET_START_DATE"]
["Карачаево-Черкесская республика","RU09","Республика Карачаево-Черкессия",{"$nulls":7},"XML_AUTHORISATION_TAG_NAMES",{"$nulls":4},"VDET_END_DATE"]
["Кемеровская область","RU42","Кемеровская область",{"$nulls":7},"L1"]
["Кировская область","RU43","Кировская область"]
["Костромская область","RU44","Костромская область",{"$nulls":3},"RESOURCE_IDENTIFIER",{"$nulls":8},"XML_MR_MO_OKTMO_LIST_TAG_NAMES"]
["Краснодарский край","RU23","Краснодарский край",{"$nulls":7},"SAX_PARSER_FEATURE",{"$nulls":4},"NSRF"]
["Красноярский край","RU24","Красноярский край",{"$nulls":7},"YES",{"$nulls":4},"MR_NAME"]
["Курганская область","RU45","Курганская область",{"$nulls":12},"OKTMO_MR_NAME"]
["Курская область","RU46","Курская область",{"$nulls":12},"MO_NAME"]
["Ленинградская область","RU47","Ленинградская область",{"$nulls":7},"VALIDATION_SETTINGS",{"$nulls":4},"OKTMO_NAME"]
["Липецкая область","RU48","Липецкая область",{"$nulls":7},"NO",{"$nulls":4},"TYPE"]
["Магаданская область","RU49","Магаданская область",{"$nulls":3},"TEMPLATE_CLAIM",{"$nulls":3},"NO"]
["Московская область","RU50","Московская область",{"$nulls":3},"P",{"$nulls":3},"NO"]
["Мурманская область","RU51","Мурманская область",{"$nulls":7},"NO"]
["Ненецкий автономный округ","RU83","Ненецкий автономный округ",{"$nulls":3},"TARIFF_SETUP_METHOD_CODE"]
["Нижегородская область","RU52","Нижегородская область",{"$nulls":3},"NA"]
["Новгородская область","RU53","Новгородская область"]
["Новосибирская область","RU54","Новосибирская область",{"$nulls":3},"TEMPLATE_PERIOD_COUNT"]
["Омская область","RU55","Омская область",{"$nulls":3},"2"]
["Оренбургская область","RU56","Оренбургская область"]
["Орловская область","RU57","Орловская область",{"$nulls":3},"TEMPLATE_SPHERE_CODE"]
["Пензенская область","RU58","Пензенская область",{"$nulls":3},"CVSNA"]
["Пермский край","RU59","Пермский край",{"$nulls":3},"HEAT"]
["Приморский край","RU25","Приморский край",{"$nulls":3},"HVSNA"]
["Псковская область","RU60","Псковская область",{"$nulls":3},"CVSNA"]
["Республика Адыгея","RU01","Республика Адыгея",{"$nulls":3},"VOTV"]
["Республика Алтай","RU04","Республика Алтай"]
["Республика Башкортостан","RU02","Республика Башкортостан",{"$nulls":7},"PAYMENT_SETUP_METHOD"]
["Республика Бурятия","RU03","Республика Бурятия",{"$nulls":7},"по отдельным мероприятиям"]
["Республика Дагестан","RU05","Республика Дагестан",{"$nulls":7},"без деления на мероприятия"]
["Республика Ингушетия","RU06","Республика Ингушетия"]
["Республика Калмыкия","RU08","Республика Калмыкия",{"$nulls":7},"HEAT_CONNECT_METHOD"]
["Республика Карелия","RU10","Республика Карелия",{"$nulls":7},"Подключение нагрузки менее 0,1 Гкал/ч"]
["Республика Коми","RU11","Республика Коми",{"$nulls":7},"Подключение нагрузки от 0,1 Гкал/ч до 1,5 Гкал/ч"]
["Республика Крым","RU82","Крым",{"$nulls":7},"Подключение нагрузки более 1,5 Гкал/ч (при наличии технической возможности)"]
["Республика Марий Эл","RU12","Республика Марий Эл",{"$nulls":7},"Подключение в индивидуальном порядке (более 1,5 Гкал/ч при отсутствии технической возможности)"]
["Республика Мордовия","RU13","Республика Мордовия"]
["Республика Саха (Якутия)","RU14","Республика Саха (Якутия)",{"$nulls":7},"HEAT_PIPELINE_METHOD"]
["Республика Северная Осетия-Алания","RU15","Республика Северная Осетия (Алания)",{"$nulls":7},"Надземная (наземная)"]
["Республика Татарстан","RU16","Республика Татарстан",{"$nulls":7},"Подземная (канальная)"]
["Республика Тыва","RU17","Республика Тыва (Тува)",{"$nulls":7},"Подземная (бесканальная)"]
["Республика Хакасия","RU19","Республика Хакасия",{"$nulls":7},"Без дифференциации"]
["Ростовская область","RU61","Ростовская область"]
["Рязанская область","RU62","Рязанская область",{"$nulls":7},"HEAT_PIPELINE_DIAMETER"]
["Самарская область","RU63","Самарская область",{"$nulls":7},"без дифференциации"]
["Саратовская область","RU64","Саратовская область",{"$nulls":7},"50 - 250 мм"]
["Сахалинская область","RU65","Сахалинская область",{"$nulls":7},"251 - 400 мм"]
["Свердловская область","RU66","Свердловская область",{"$nulls":7},"401 - 550 мм"]
["Смоленская область","RU67","Смоленская область",{"$nulls":7},"551 - 700 мм"]
["Ставропольский край","RU26","Ставропольский край",{"$nulls":7},"701 мм и более"]
["Тамбовская область","RU68","Тамбовская область"]
["Тверская область","RU69","Тверская область"]
["Томская область","RU70","Томская область",{"$nulls":7},"HVSNA_CONNECT_METHOD"]
["Тульская область","RU71","Тульская область",{"$nulls":7},"Подключение к ЦГВС в общем порядке (в случае несоответствия критериям установления платы за подключение в индивидуальном порядке)"]
["Тюменская область","RU72","Тюменская область",{"$nulls":7},"Подключение к ЦГВС в индивидуальном порядке"]
["Удмуртская республика","RU18","Республика Удмуртия"]
["Ульяновская область","RU73","Ульяновская область",{"$nulls":7},"HVSNA_PIPELINE_DIAMETER"]
["Хабаровский край","RU27","Хабаровский край",{"$nulls":7},"без дифференциации"]
["Ханты-Мансийский автономный округ","RU86","Ханты-Мансийский автономный округ",{"$nulls":7},"40 мм и менее"]
["Челябинская область","RU74","Челябинская область",{"$nulls":7},"40 - 70 мм"]
["Чеченская республика","RU20","Республика Чечня",{"$nulls":7},"70 - 100 мм"]
["Чувашская республика","RU21","Республика Чувашия",{"$nulls":7},"100 - 150 мм"]
["Чукотский автономный округ","RU87","Чукотский автономный округ",{"$nulls":7},"150 - 200 мм"]
["Ямало-Ненецкий автономный округ","RU89","Ямало-Ненецкий автономный округ",{"$nulls":7},"200 - 250 мм"]
["Ярославская область","RU76","Ярославская область",{"$nulls":7},"250 мм и более"]
[]
[]
[{"$nulls":10},"CVSNA_CONNECT_METHOD"]
[{"$nulls":10},"Подключение к ЦХВС в общем порядке (в случае несоответствия критериям установления платы за подключение в индивидуальном порядке)"]
[{"$nulls":10},"Подключение к ЦХВС в индивидуальном порядке"]
[]
[{"$nulls":10},"CVSNA_PIPELINE_DIAMETER"]
[{"$nulls":10},"без дифференциации"]
[{"$nulls":10},"40 мм и менее"]
[{"$nulls":10},"40 - 70 мм"]
[{"$nulls":10},"70 - 100 мм"]
[{"$nulls":10},"100 - 150 мм"]
[{"$nulls":10},"150 - 200 мм"]
[{"$nulls":10},"200 - 250 мм"]
[{"$nulls":10},"250 мм и более"]
[]
[]
[{"$nulls":10},"VOTV_CONNECT_METHOD"]
[{"$nulls":10},"Подключение к ЦСВО в общем порядке (в случае несоответствия критериям установления платы за подключение в индивидуальном порядке)"]
[{"$nulls":10},"Подключение к ЦСВО в индивидуальном порядке"]
[]
[{"$nulls":10},"VOTV_PIPELINE_DIAMETER"]
[{"$nulls":10},"без дифференциации"]
[{"$nulls":10},"40 мм и менее"]
[{"$nulls":10},"40 - 70 мм"]
[{"$nulls":10},"70 - 100 мм"]
[{"$nulls":10},"100 - 150 мм"]
[{"$nulls":10},"150 - 200 мм"]
[{"$nulls":10},"200 - 250 мм"]
[{"$nulls":10},"250 мм и более"]
{"$rows_empty":337}
[{"$f":"\"HTP.P('<\" &#REF! & \">' || \" & IF(MID(#REF!,1,4)=\"STUB\",\"NULL\",\"REC.\" &#REF!) & \" || '</\" &#REF! & \">');\"","v":{"$error":"#REF!"}},null,{"$f":"\"DECODE(C_T.\" &#REF! & \", 0, NULL, C_T.\" &#REF! & \") AS \" &#REF! & \",\"","v":{"$error":"#REF!"}}]
[{"$f":"\"HTP.P('<\" &#REF! & \">' || \" & IF(MID(#REF!,1,4)=\"STUB\",\"NULL\",\"REC.\" &#REF!) & \" || '</\" &#REF! & \">');\"","v":{"$error":"#REF!"}},null,{"$f":"\"DECODE(C_T.\" &#REF! & \", 0, NULL, C_T.\" &#REF! & \") AS \" &#REF! & \",\"","v":{"$error":"#REF!"}}]
[{"$f":"\"HTP.P('<\" &#REF! & \">' || \" & IF(MID(#REF!,1,4)=\"STUB\",\"NULL\",\"REC.\" &#REF!) & \" || '</\" &#REF! & \">');\"","v":{"$error":"#REF!"}},null,{"$f":"\"DECODE(C_T.\" &#REF! & \", 0, NULL, C_T.\" &#REF! & \") AS \" &#REF! & \",\"","v":{"$error":"#REF!"}}]
[{"$f":"\"HTP.P('<\" &#REF! & \">' || \" & IF(MID(#REF!,1,4)=\"STUB\",\"NULL\",\"REC.\" &#REF!) & \" || '</\" &#REF! & \">');\"","v":{"$error":"#REF!"}},null,{"$f":"\"DECODE(C_T.\" &#REF! & \", 0, NULL, C_T.\" &#REF! & \") AS \" &#REF! & \",\"","v":{"$error":"#REF!"}}]
[{"$f":"\"HTP.P('<\" &#REF! & \">' || \" & IF(MID(#REF!,1,4)=\"STUB\",\"NULL\",\"REC.\" &#REF!) & \" || '</\" &#REF! & \">');\"","v":{"$error":"#REF!"}},null,{"$f":"\"DECODE(C_T.\" &#REF! & \", 0, NULL, C_T.\" &#REF! & \") AS \" &#REF! & \",\"","v":{"$error":"#REF!"}}]
[{"$f":"\"HTP.P('<\" &#REF! & \">' || \" & IF(MID(#REF!,1,4)=\"STUB\",\"NULL\",\"REC.\" &#REF!) & \" || '</\" &#REF! & \">');\"","v":{"$error":"#REF!"}},null,{"$f":"\"DECODE(C_T.\" &#REF! & \", 0, NULL, C_T.\" &#REF! & \") AS \" &#REF! & \",\"","v":{"$error":"#REF!"}}]
[{"$f":"\"HTP.P('<\" &#REF! & \">' || \" & IF(MID(#REF!,1,4)=\"STUB\",\"NULL\",\"REC.\" &#REF!) & \" || '</\" &#REF! & \">');\"","v":{"$error":"#REF!"}},null,{"$f":"\"DECODE(C_T.\" &#REF! & \", 0, NULL, C_T.\" &#REF! & \") AS \" &#REF! & \",\"","v":{"$error":"#REF!"}}]
[{"$f":"\"HTP.P('<\" &#REF! & \">' || \" & IF(MID(#REF!,1,4)=\"STUB\",\"NULL\",\"REC.\" &#REF!) & \" || '</\" &#REF! & \">');\"","v":{"$error":"#REF!"}},null,{"$f":"\"DECODE(C_T.\" &#REF! & \", 0, NULL, C_T.\" &#REF! & \") AS \" &#REF! & \",\"","v":{"$error":"#REF!"}}]
[{"$f":"\"HTP.P('<\" &#REF! & \">' || \" & IF(MID(#REF!,1,4)=\"STUB\",\"NULL\",\"REC.\" &#REF!) & \" || '</\" &#REF! & \">');\"","v":{"$error":"#REF!"}},null,{"$f":"\"DECODE(C_T.\" &#REF! & \", 0, NULL, C_T.\" &#REF! & \") AS \" &#REF! & \",\"","v":{"$error":"#REF!"}}]
[{"$f":"\"HTP.P('<\" &#REF! & \">' || \" & IF(MID(#REF!,1,4)=\"STUB\",\"NULL\",\"REC.\" &#REF!) & \" || '</\" &#REF! & \">');\"","v":{"$error":"#REF!"}},null,{"$f":"\"DECODE(C_T.\" &#REF! & \", 0, NULL, C_T.\" &#REF! & \") AS \" &#REF! & \",\"","v":{"$error":"#REF!"}}]
[{"$f":"\"HTP.P('<\" &#REF! & \">' || \" & IF(MID(#REF!,1,4)=\"STUB\",\"NULL\",\"REC.\" &#REF!) & \" || '</\" &#REF! & \">');\"","v":{"$error":"#REF!"}},null,{"$f":"\"DECODE(C_T.\" &#REF! & \", 0, NULL, C_T.\" &#REF! & \") AS \" &#REF! & \",\"","v":{"$error":"#REF!"}}]
[{"$f":"\"HTP.P('<\" &#REF! & \">' || \" & IF(MID(#REF!,1,4)=\"STUB\",\"NULL\",\"REC.\" &#REF!) & \" || '</\" &#REF! & \">');\"","v":{"$error":"#REF!"}},null,{"$f":"\"DECODE(C_T.\" &#REF! & \", 0, NULL, C_T.\" &#REF! & \") AS \" &#REF! & \",\"","v":{"$error":"#REF!"}}]
[{"$f":"\"HTP.P('<\" &#REF! & \">' || \" & IF(MID(#REF!,1,4)=\"STUB\",\"NULL\",\"REC.\" &#REF!) & \" || '</\" &#REF! & \">');\"","v":{"$error":"#REF!"}},null,{"$f":"\"DECODE(C_T.\" &#REF! & \", 0, NULL, C_T.\" &#REF! & \") AS \" &#REF! & \",\"","v":{"$error":"#REF!"}}]
[{"$f":"\"HTP.P('<\" &#REF! & \">' || \" & IF(MID(#REF!,1,4)=\"STUB\",\"NULL\",\"REC.\" &#REF!) & \" || '</\" &#REF! & \">');\"","v":{"$error":"#REF!"}},null,{"$f":"\"DECODE(C_T.\" &#REF! & \", 0, NULL, C_T.\" &#REF! & \") AS \" &#REF! & \",\"","v":{"$error":"#REF!"}}]
[{"$f":"\"HTP.P('<\" &#REF! & \">' || \" & IF(MID(#REF!,1,4)=\"STUB\",\"NULL\",\"REC.\" &#REF!) & \" || '</\" &#REF! & \">');\"","v":{"$error":"#REF!"}},null,{"$f":"\"DECODE(C_T.\" &#REF! & \", 0, NULL, C_T.\" &#REF! & \") AS \" &#REF! & \",\"","v":{"$error":"#REF!"}}]
[{"$f":"\"HTP.P('<\" & M491 & \">' || \" & IF(MID(M491,1,4)=\"STUB\",\"NULL\",\"REC.\" & M491) & \" || '</\" & M491 & \">');\"","v":"HTP.P('<>' || REC. || '</>');"},null,{"$f":"\"DECODE(C_T.\" & M491 & \", 0, NULL, C_T.\" & M491 & \") AS \" & M491 & \",\"","v":"DECODE(C_T., 0, NULL, C_T.) AS ,"}]
[{"$f":"\"HTP.P('<\" &#REF! & \">' || \" & IF(MID(#REF!,1,4)=\"STUB\",\"NULL\",\"REC.\" &#REF!) & \" || '</\" &#REF! & \">');\"","v":{"$error":"#REF!"}},null,{"$f":"\"DECODE(C_T.\" &#REF! & \", 0, NULL, C_T.\" &#REF! & \") AS \" &#REF! & \",\"","v":{"$error":"#REF!"}}]
[{"$f":"\"HTP.P('<\" &#REF! & \">' || \" & IF(MID(#REF!,1,4)=\"STUB\",\"NULL\",\"REC.\" &#REF!) & \" || '</\" &#REF! & \">');\"","v":{"$error":"#REF!"}},null,{"$f":"\"DECODE(C_T.\" &#REF! & \", 0, NULL, C_T.\" &#REF! & \") AS \" &#REF! & \",\"","v":{"$error":"#REF!"}}]
[{"$f":"\"HTP.P('<\" &#REF! & \">' || \" & IF(MID(#REF!,1,4)=\"STUB\",\"NULL\",\"REC.\" &#REF!) & \" || '</\" &#REF! & \">');\"","v":{"$error":"#REF!"}},null,{"$f":"\"DECODE(C_T.\" &#REF! & \", 0, NULL, C_T.\" &#REF! & \") AS \" &#REF! & \",\"","v":{"$error":"#REF!"}}]
[{"$f":"\"HTP.P('<\" &#REF! & \">' || \" & IF(MID(#REF!,1,4)=\"STUB\",\"NULL\",\"REC.\" &#REF!) & \" || '</\" &#REF! & \">');\"","v":{"$error":"#REF!"}},null,{"$f":"\"DECODE(C_T.\" &#REF! & \", 0, NULL, C_T.\" &#REF! & \") AS \" &#REF! & \",\"","v":{"$error":"#REF!"}}]
[{"$f":"\"HTP.P('<\" &#REF! & \">' || \" & IF(MID(#REF!,1,4)=\"STUB\",\"NULL\",\"REC.\" &#REF!) & \" || '</\" &#REF! & \">');\"","v":{"$error":"#REF!"}},null,{"$f":"\"DECODE(C_T.\" &#REF! & \", 0, NULL, C_T.\" &#REF! & \") AS \" &#REF! & \",\"","v":{"$error":"#REF!"}}]
[{"$f":"\"HTP.P('<\" &#REF! & \">' || \" & IF(MID(#REF!,1,4)=\"STUB\",\"NULL\",\"REC.\" &#REF!) & \" || '</\" &#REF! & \">');\"","v":{"$error":"#REF!"}},null,{"$f":"\"DECODE(C_T.\" &#REF! & \", 0, NULL, C_T.\" &#REF! & \") AS \" &#REF! & \",\"","v":{"$error":"#REF!"}}]
[{"$f":"\"HTP.P('<\" &#REF! & \">' || \" & IF(MID(#REF!,1,4)=\"STUB\",\"NULL\",\"REC.\" &#REF!) & \" || '</\" &#REF! & \">');\"","v":{"$error":"#REF!"}},null,{"$f":"\"DECODE(C_T.\" &#REF! & \", 0, NULL, C_T.\" &#REF! & \") AS \" &#REF! & \",\"","v":{"$error":"#REF!"}}]
[{"$f":"\"HTP.P('<\" &#REF! & \">' || \" & IF(MID(#REF!,1,4)=\"STUB\",\"NULL\",\"REC.\" &#REF!) & \" || '</\" &#REF! & \">');\"","v":{"$error":"#REF!"}},null,{"$f":"\"DECODE(C_T.\" &#REF! & \", 0, NULL, C_T.\" &#REF! & \") AS \" &#REF! & \",\"","v":{"$error":"#REF!"}}]
[{"$f":"\"HTP.P('<\" &#REF! & \">' || \" & IF(MID(#REF!,1,4)=\"STUB\",\"NULL\",\"REC.\" &#REF!) & \" || '</\" &#REF! & \">');\"","v":{"$error":"#REF!"}},null,{"$f":"\"DECODE(C_T.\" &#REF! & \", 0, NULL, C_T.\" &#REF! & \") AS \" &#REF! & \",\"","v":{"$error":"#REF!"}}]
[{"$f":"\"HTP.P('<\" &#REF! & \">' || \" & IF(MID(#REF!,1,4)=\"STUB\",\"NULL\",\"REC.\" &#REF!) & \" || '</\" &#REF! & \">');\"","v":{"$error":"#REF!"}},null,{"$f":"\"DECODE(C_T.\" &#REF! & \", 0, NULL, C_T.\" &#REF! & \") AS \" &#REF! & \",\"","v":{"$error":"#REF!"}}]
[{"$f":"\"HTP.P('<\" &#REF! & \">' || \" & IF(MID(#REF!,1,4)=\"STUB\",\"NULL\",\"REC.\" &#REF!) & \" || '</\" &#REF! & \">');\"","v":{"$error":"#REF!"}},null,{"$f":"\"DECODE(C_T.\" &#REF! & \", 0, NULL, C_T.\" &#REF! & \") AS \" &#REF! & \",\"","v":{"$error":"#REF!"}}]
[{"$f":"\"HTP.P('<\" &#REF! & \">' || \" & IF(MID(#REF!,1,4)=\"STUB\",\"NULL\",\"REC.\" &#REF!) & \" || '</\" &#REF! & \">');\"","v":{"$error":"#REF!"}},null,{"$f":"\"DECODE(C_T.\" &#REF! & \", 0, NULL, C_T.\" &#REF! & \") AS \" &#REF! & \",\"","v":{"$error":"#REF!"}}]
[{"$f":"\"HTP.P('<\" &#REF! & \">' || \" & IF(MID(#REF!,1,4)=\"STUB\",\"NULL\",\"REC.\" &#REF!) & \" || '</\" &#REF! & \">');\"","v":{"$error":"#REF!"}},null,{"$f":"\"DECODE(C_T.\" &#REF! & \", 0, NULL, C_T.\" &#REF! & \") AS \" &#REF! & \",\"","v":{"$error":"#REF!"}}]
[{"$f":"\"HTP.P('<\" &#REF! & \">' || \" & IF(MID(#REF!,1,4)=\"STUB\",\"NULL\",\"REC.\" &#REF!) & \" || '</\" &#REF! & \">');\"","v":{"$error":"#REF!"}},null,{"$f":"\"DECODE(C_T.\" &#REF! & \", 0, NULL, C_T.\" &#REF! & \") AS \" &#REF! & \",\"","v":{"$error":"#REF!"}}]
[{"$f":"\"HTP.P('<\" &#REF! & \">' || \" & IF(MID(#REF!,1,4)=\"STUB\",\"NULL\",\"REC.\" &#REF!) & \" || '</\" &#REF! & \">');\"","v":{"$error":"#REF!"}},null,{"$f":"\"DECODE(C_T.\" &#REF! & \", 0, NULL, C_T.\" &#REF! & \") AS \" &#REF! & \",\"","v":{"$error":"#REF!"}}]
[{"$f":"\"HTP.P('<\" &#REF! & \">' || \" & IF(MID(#REF!,1,4)=\"STUB\",\"NULL\",\"REC.\" &#REF!) & \" || '</\" &#REF! & \">');\"","v":{"$error":"#REF!"}},null,{"$f":"\"DECODE(C_T.\" &#REF! & \", 0, NULL, C_T.\" &#REF! & \") AS \" &#REF! & \",\"","v":{"$error":"#REF!"}}]
[{"$f":"\"HTP.P('<\" &#REF! & \">' || \" & IF(MID(#REF!,1,4)=\"STUB\",\"NULL\",\"REC.\" &#REF!) & \" || '</\" &#REF! & \">');\"","v":{"$error":"#REF!"}},null,{"$f":"\"DECODE(C_T.\" &#REF! & \", 0, NULL, C_T.\" &#REF! & \") AS \" &#REF! & \",\"","v":{"$error":"#REF!"}}]
[{"$f":"\"HTP.P('<\" &#REF! & \">' || \" & IF(MID(#REF!,1,4)=\"STUB\",\"NULL\",\"REC.\" &#REF!) & \" || '</\" &#REF! & \">');\"","v":{"$error":"#REF!"}},null,{"$f":"\"DECODE(C_T.\" &#REF! & \", 0, NULL, C_T.\" &#REF! & \") AS \" &#REF! & \",\"","v":{"$error":"#REF!"}}]
[{"$f":"\"HTP.P('<\" &#REF! & \">' || \" & IF(MID(#REF!,1,4)=\"STUB\",\"NULL\",\"REC.\" &#REF!) & \" || '</\" &#REF! & \">');\"","v":{"$error":"#REF!"}},null,{"$f":"\"DECODE(C_T.\" &#REF! & \", 0, NULL, C_T.\" &#REF! & \") AS \" &#REF! & \",\"","v":{"$error":"#REF!"}}]
[{"$f":"\"HTP.P('<\" &#REF! & \">' || \" & IF(MID(#REF!,1,4)=\"STUB\",\"NULL\",\"REC.\" &#REF!) & \" || '</\" &#REF! & \">');\"","v":{"$error":"#REF!"}},null,{"$f":"\"DECODE(C_T.\" &#REF! & \", 0, NULL, C_T.\" &#REF! & \") AS \" &#REF! & \",\"","v":{"$error":"#REF!"}}]
[{"$f":"\"HTP.P('<\" &#REF! & \">' || \" & IF(MID(#REF!,1,4)=\"STUB\",\"NULL\",\"REC.\" &#REF!) & \" || '</\" &#REF! & \">');\"","v":{"$error":"#REF!"}},null,{"$f":"\"DECODE(C_T.\" &#REF! & \", 0, NULL, C_T.\" &#REF! & \") AS \" &#REF! & \",\"","v":{"$error":"#REF!"}}]
[{"$f":"\"HTP.P('<\" &#REF! & \">' || \" & IF(MID(#REF!,1,4)=\"STUB\",\"NULL\",\"REC.\" &#REF!) & \" || '</\" &#REF! & \">');\"","v":{"$error":"#REF!"}},null,{"$f":"\"DECODE(C_T.\" &#REF! & \", 0, NULL, C_T.\" &#REF! & \") AS \" &#REF! & \",\"","v":{"$error":"#REF!"}}]
[{"$f":"\"HTP.P('<\" &#REF! & \">' || \" & IF(MID(#REF!,1,4)=\"STUB\",\"NULL\",\"REC.\" &#REF!) & \" || '</\" &#REF! & \">');\"","v":{"$error":"#REF!"}},null,{"$f":"\"DECODE(C_T.\" &#REF! & \", 0, NULL, C_T.\" &#REF! & \") AS \" &#REF! & \",\"","v":{"$error":"#REF!"}}]
[{"$f":"\"HTP.P('<\" &#REF! & \">' || \" & IF(MID(#REF!,1,4)=\"STUB\",\"NULL\",\"REC.\" &#REF!) & \" || '</\" &#REF! & \">');\"","v":{"$error":"#REF!"}},null,{"$f":"\"DECODE(C_T.\" &#REF! & \", 0, NULL, C_T.\" &#REF! & \") AS \" &#REF! & \",\"","v":{"$error":"#REF!"}}]
[{"$f":"\"HTP.P('<\" &#REF! & \">' || \" & IF(MID(#REF!,1,4)=\"STUB\",\"NULL\",\"REC.\" &#REF!) & \" || '</\" &#REF! & \">');\"","v":{"$error":"#REF!"}},null,{"$f":"\"DECODE(C_T.\" &#REF! & \", 0, NULL, C_T.\" &#REF! & \") AS \" &#REF! & \",\"","v":{"$error":"#REF!"}}]
[{"$f":"\"HTP.P('<\" &#REF! & \">' || \" & IF(MID(#REF!,1,4)=\"STUB\",\"NULL\",\"REC.\" &#REF!) & \" || '</\" &#REF! & \">');\"","v":{"$error":"#REF!"}},null,{"$f":"\"DECODE(C_T.\" &#REF! & \", 0, NULL, C_T.\" &#REF! & \") AS \" &#REF! & \",\"","v":{"$error":"#REF!"}}]
[{"$f":"\"HTP.P('<\" &#REF! & \">' || \" & IF(MID(#REF!,1,4)=\"STUB\",\"NULL\",\"REC.\" &#REF!) & \" || '</\" &#REF! & \">');\"","v":{"$error":"#REF!"}},null,{"$f":"\"DECODE(C_T.\" &#REF! & \", 0, NULL, C_T.\" &#REF! & \") AS \" &#REF! & \",\"","v":{"$error":"#REF!"}}]
[{"$f":"\"HTP.P('<\" &#REF! & \">' || \" & IF(MID(#REF!,1,4)=\"STUB\",\"NULL\",\"REC.\" &#REF!) & \" || '</\" &#REF! & \">');\"","v":{"$error":"#REF!"}},null,{"$f":"\"DECODE(C_T.\" &#REF! & \", 0, NULL, C_T.\" &#REF! & \") AS \" &#REF! & \",\"","v":{"$error":"#REF!"}}]
[{"$f":"\"HTP.P('<\" &#REF! & \">' || \" & IF(MID(#REF!,1,4)=\"STUB\",\"NULL\",\"REC.\" &#REF!) & \" || '</\" &#REF! & \">');\"","v":{"$error":"#REF!"}},null,{"$f":"\"DECODE(C_T.\" &#REF! & \", 0, NULL, C_T.\" &#REF! & \") AS \" &#REF! & \",\"","v":{"$error":"#REF!"}}]
[{"$f":"\"HTP.P('<\" &#REF! & \">' || \" & IF(MID(#REF!,1,4)=\"STUB\",\"NULL\",\"REC.\" &#REF!) & \" || '</\" &#REF! & \">');\"","v":{"$error":"#REF!"}},null,{"$f":"\"DECODE(C_T.\" &#REF! & \", 0, NULL, C_T.\" &#REF! & \") AS \" &#REF! & \",\"","v":{"$error":"#REF!"}}]
[{"$f":"\"HTP.P('<\" &#REF! & \">' || \" & IF(MID(#REF!,1,4)=\"STUB\",\"NULL\",\"REC.\" &#REF!) & \" || '</\" &#REF! & \">');\"","v":{"$error":"#REF!"}},null,{"$f":"\"DECODE(C_T.\" &#REF! & \", 0, NULL, C_T.\" &#REF! & \") AS \" &#REF! & \",\"","v":{"$error":"#REF!"}}]
[{"$f":"\"HTP.P('<\" &#REF! & \">' || \" & IF(MID(#REF!,1,4)=\"STUB\",\"NULL\",\"REC.\" &#REF!) & \" || '</\" &#REF! & \">');\"","v":{"$error":"#REF!"}},null,{"$f":"\"DECODE(C_T.\" &#REF! & \", 0, NULL, C_T.\" &#REF! & \") AS \" &#REF! & \",\"","v":{"$error":"#REF!"}}]
[{"$f":"\"HTP.P('<\" &#REF! & \">' || \" & IF(MID(#REF!,1,4)=\"STUB\",\"NULL\",\"REC.\" &#REF!) & \" || '</\" &#REF! & \">');\"","v":{"$error":"#REF!"}},null,{"$f":"\"DECODE(C_T.\" &#REF! & \", 0, NULL, C_T.\" &#REF! & \") AS \" &#REF! & \",\"","v":{"$error":"#REF!"}}]
[{"$f":"\"HTP.P('<\" &#REF! & \">' || \" & IF(MID(#REF!,1,4)=\"STUB\",\"NULL\",\"REC.\" &#REF!) & \" || '</\" &#REF! & \">');\"","v":{"$error":"#REF!"}},null,{"$f":"\"DECODE(C_T.\" &#REF! & \", 0, NULL, C_T.\" &#REF! & \") AS \" &#REF! & \",\"","v":{"$error":"#REF!"}}]
[{"$f":"\"HTP.P('<\" &#REF! & \">' || \" & IF(MID(#REF!,1,4)=\"STUB\",\"NULL\",\"REC.\" &#REF!) & \" || '</\" &#REF! & \">');\"","v":{"$error":"#REF!"}},null,{"$f":"\"DECODE(C_T.\" &#REF! & \", 0, NULL, C_T.\" &#REF! & \") AS \" &#REF! & \",\"","v":{"$error":"#REF!"}}]
[{"$f":"\"HTP.P('<\" &#REF! & \">' || \" & IF(MID(#REF!,1,4)=\"STUB\",\"NULL\",\"REC.\" &#REF!) & \" || '</\" &#REF! & \">');\"","v":{"$error":"#REF!"}},null,{"$f":"\"DECODE(C_T.\" &#REF! & \", 0, NULL, C_T.\" &#REF! & \") AS \" &#REF! & \",\"","v":{"$error":"#REF!"}}]
[{"$f":"\"HTP.P('<\" &#REF! & \">' || \" & IF(MID(#REF!,1,4)=\"STUB\",\"NULL\",\"REC.\" &#REF!) & \" || '</\" &#REF! & \">');\"","v":{"$error":"#REF!"}},null,{"$f":"\"DECODE(C_T.\" &#REF! & \", 0, NULL, C_T.\" &#REF! & \") AS \" &#REF! & \",\"","v":{"$error":"#REF!"}}]
[{"$f":"\"HTP.P('<\" &#REF! & \">' || \" & IF(MID(#REF!,1,4)=\"STUB\",\"NULL\",\"REC.\" &#REF!) & \" || '</\" &#REF! & \">');\"","v":{"$error":"#REF!"}},null,{"$f":"\"DECODE(C_T.\" &#REF! & \", 0, NULL, C_T.\" &#REF! & \") AS \" &#REF! & \",\"","v":{"$error":"#REF!"}}]
[{"$f":"\"HTP.P('<\" &#REF! & \">' || \" & IF(MID(#REF!,1,4)=\"STUB\",\"NULL\",\"REC.\" &#REF!) & \" || '</\" &#REF! & \">');\"","v":{"$error":"#REF!"}},null,{"$f":"\"DECODE(C_T.\" &#REF! & \", 0, NULL, C_T.\" &#REF! & \") AS \" &#REF! & \",\"","v":{"$error":"#REF!"}}]
[{"$f":"\"HTP.P('<\" &#REF! & \">' || \" & IF(MID(#REF!,1,4)=\"STUB\",\"NULL\",\"REC.\" &#REF!) & \" || '</\" &#REF! & \">');\"","v":{"$error":"#REF!"}},null,{"$f":"\"DECODE(C_T.\" &#REF! & \", 0, NULL, C_T.\" &#REF! & \") AS \" &#REF! & \",\"","v":{"$error":"#REF!"}}]
[{"$f":"\"HTP.P('<\" &#REF! & \">' || \" & IF(MID(#REF!,1,4)=\"STUB\",\"NULL\",\"REC.\" &#REF!) & \" || '</\" &#REF! & \">');\"","v":{"$error":"#REF!"}},null,{"$f":"\"DECODE(C_T.\" &#REF! & \", 0, NULL, C_T.\" &#REF! & \") AS \" &#REF! & \",\"","v":{"$error":"#REF!"}}]
[{"$f":"\"HTP.P('<\" &#REF! & \">' || \" & IF(MID(#REF!,1,4)=\"STUB\",\"NULL\",\"REC.\" &#REF!) & \" || '</\" &#REF! & \">');\"","v":{"$error":"#REF!"}},null,{"$f":"\"DECODE(C_T.\" &#REF! & \", 0, NULL, C_T.\" &#REF! & \") AS \" &#REF! & \",\"","v":{"$error":"#REF!"}}]
[{"$f":"\"HTP.P('<\" &#REF! & \">' || \" & IF(MID(#REF!,1,4)=\"STUB\",\"NULL\",\"REC.\" &#REF!) & \" || '</\" &#REF! & \">');\"","v":{"$error":"#REF!"}},null,{"$f":"\"DECODE(C_T.\" &#REF! & \", 0, NULL, C_T.\" &#REF! & \") AS \" &#REF! & \",\"","v":{"$error":"#REF!"}}]
[{"$f":"\"HTP.P('<\" &#REF! & \">' || \" & IF(MID(#REF!,1,4)=\"STUB\",\"NULL\",\"REC.\" &#REF!) & \" || '</\" &#REF! & \">');\"","v":{"$error":"#REF!"}},null,{"$f":"\"DECODE(C_T.\" &#REF! & \", 0, NULL, C_T.\" &#REF! & \") AS \" &#REF! & \",\"","v":{"$error":"#REF!"}}]
[{"$f":"\"HTP.P('<\" &#REF! & \">' || \" & IF(MID(#REF!,1,4)=\"STUB\",\"NULL\",\"REC.\" &#REF!) & \" || '</\" &#REF! & \">');\"","v":{"$error":"#REF!"}},null,{"$f":"\"DECODE(C_T.\" &#REF! & \", 0, NULL, C_T.\" &#REF! & \") AS \" &#REF! & \",\"","v":{"$error":"#REF!"}}]
[{"$f":"\"HTP.P('<\" &#REF! & \">' || \" & IF(MID(#REF!,1,4)=\"STUB\",\"NULL\",\"REC.\" &#REF!) & \" || '</\" &#REF! & \">');\"","v":{"$error":"#REF!"}},null,{"$f":"\"DECODE(C_T.\" &#REF! & \", 0, NULL, C_T.\" &#REF! & \") AS \" &#REF! & \",\"","v":{"$error":"#REF!"}}]
[{"$f":"\"HTP.P('<\" &#REF! & \">' || \" & IF(MID(#REF!,1,4)=\"STUB\",\"NULL\",\"REC.\" &#REF!) & \" || '</\" &#REF! & \">');\"","v":{"$error":"#REF!"}},null,{"$f":"\"DECODE(C_T.\" &#REF! & \", 0, NULL, C_T.\" &#REF! & \") AS \" &#REF! & \",\"","v":{"$error":"#REF!"}}]
[{"$f":"\"HTP.P('<\" &#REF! & \">' || \" & IF(MID(#REF!,1,4)=\"STUB\",\"NULL\",\"REC.\" &#REF!) & \" || '</\" &#REF! & \">');\"","v":{"$error":"#REF!"}},null,{"$f":"\"DECODE(C_T.\" &#REF! & \", 0, NULL, C_T.\" &#REF! & \") AS \" &#REF! & \",\"","v":{"$error":"#REF!"}}]
[{"$f":"\"HTP.P('<\" &#REF! & \">' || \" & IF(MID(#REF!,1,4)=\"STUB\",\"NULL\",\"REC.\" &#REF!) & \" || '</\" &#REF! & \">');\"","v":{"$error":"#REF!"}},null,{"$f":"\"DECODE(C_T.\" &#REF! & \", 0, NULL, C_T.\" &#REF! & \") AS \" &#REF! & \",\"","v":{"$error":"#REF!"}}]
[{"$f":"\"HTP.P('<\" &#REF! & \">' || \" & IF(MID(#REF!,1,4)=\"STUB\",\"NULL\",\"REC.\" &#REF!) & \" || '</\" &#REF! & \">');\"","v":{"$error":"#REF!"}},null,{"$f":"\"DECODE(C_T.\" &#REF! & \", 0, NULL, C_T.\" &#REF! & \") AS \" &#REF! & \",\"","v":{"$error":"#REF!"}}]
[{"$f":"\"HTP.P('<\" &#REF! & \">' || \" & IF(MID(#REF!,1,4)=\"STUB\",\"NULL\",\"REC.\" &#REF!) & \" || '</\" &#REF! & \">');\"","v":{"$error":"#REF!"}},null,{"$f":"\"DECODE(C_T.\" &#REF! & \", 0, NULL, C_T.\" &#REF! & \") AS \" &#REF! & \",\"","v":{"$error":"#REF!"}}]
[{"$f":"\"HTP.P('<\" &#REF! & \">' || \" & IF(MID(#REF!,1,4)=\"STUB\",\"NULL\",\"REC.\" &#REF!) & \" || '</\" &#REF! & \">');\"","v":{"$error":"#REF!"}},null,{"$f":"\"DECODE(C_T.\" &#REF! & \", 0, NULL, C_T.\" &#REF! & \") AS \" &#REF! & \",\"","v":{"$error":"#REF!"}}]
[{"$f":"\"HTP.P('<\" &#REF! & \">' || \" & IF(MID(#REF!,1,4)=\"STUB\",\"NULL\",\"REC.\" &#REF!) & \" || '</\" &#REF! & \">');\"","v":{"$error":"#REF!"}},null,{"$f":"\"DECODE(C_T.\" &#REF! & \", 0, NULL, C_T.\" &#REF! & \") AS \" &#REF! & \",\"","v":{"$error":"#REF!"}}]
[{"$f":"\"HTP.P('<\" &#REF! & \">' || \" & IF(MID(#REF!,1,4)=\"STUB\",\"NULL\",\"REC.\" &#REF!) & \" || '</\" &#REF! & \">');\"","v":{"$error":"#REF!"}},null,{"$f":"\"DECODE(C_T.\" &#REF! & \", 0, NULL, C_T.\" &#REF! & \") AS \" &#REF! & \",\"","v":{"$error":"#REF!"}}]
[{"$f":"\"HTP.P('<\" &#REF! & \">' || \" & IF(MID(#REF!,1,4)=\"STUB\",\"NULL\",\"REC.\" &#REF!) & \" || '</\" &#REF! & \">');\"","v":{"$error":"#REF!"}},null,{"$f":"\"DECODE(C_T.\" &#REF! & \", 0, NULL, C_T.\" &#REF! & \") AS \" &#REF! & \",\"","v":{"$error":"#REF!"}}]
[{"$f":"\"HTP.P('<\" &#REF! & \">' || \" & IF(MID(#REF!,1,4)=\"STUB\",\"NULL\",\"REC.\" &#REF!) & \" || '</\" &#REF! & \">');\"","v":{"$error":"#REF!"}},null,{"$f":"\"DECODE(C_T.\" &#REF! & \", 0, NULL, C_T.\" &#REF! & \") AS \" &#REF! & \",\"","v":{"$error":"#REF!"}}]
[{"$f":"\"HTP.P('<\" &#REF! & \">' || \" & IF(MID(#REF!,1,4)=\"STUB\",\"NULL\",\"REC.\" &#REF!) & \" || '</\" &#REF! & \">');\"","v":{"$error":"#REF!"}},null,{"$f":"\"DECODE(C_T.\" &#REF! & \", 0, NULL, C_T.\" &#REF! & \") AS \" &#REF! & \",\"","v":{"$error":"#REF!"}}]
[{"$f":"\"HTP.P('<\" &#REF! & \">' || \" & IF(MID(#REF!,1,4)=\"STUB\",\"NULL\",\"REC.\" &#REF!) & \" || '</\" &#REF! & \">');\"","v":{"$error":"#REF!"}},null,{"$f":"\"DECODE(C_T.\" &#REF! & \", 0, NULL, C_T.\" &#REF! & \") AS \" &#REF! & \",\"","v":{"$error":"#REF!"}}]
[{"$f":"\"HTP.P('<\" &#REF! & \">' || \" & IF(MID(#REF!,1,4)=\"STUB\",\"NULL\",\"REC.\" &#REF!) & \" || '</\" &#REF! & \">');\"","v":{"$error":"#REF!"}},null,{"$f":"\"DECODE(C_T.\" &#REF! & \", 0, NULL, C_T.\" &#REF! & \") AS \" &#REF! & \",\"","v":{"$error":"#REF!"}}]
[{"$f":"\"HTP.P('<\" &#REF! & \">' || \" & IF(MID(#REF!,1,4)=\"STUB\",\"NULL\",\"REC.\" &#REF!) & \" || '</\" &#REF! & \">');\"","v":{"$error":"#REF!"}},null,{"$f":"\"DECODE(C_T.\" &#REF! & \", 0, NULL, C_T.\" &#REF! & \") AS \" &#REF! & \",\"","v":{"$error":"#REF!"}}]
[{"$f":"\"HTP.P('<\" &#REF! & \">' || \" & IF(MID(#REF!,1,4)=\"STUB\",\"NULL\",\"REC.\" &#REF!) & \" || '</\" &#REF! & \">');\"","v":{"$error":"#REF!"}},null,{"$f":"\"DECODE(C_T.\" &#REF! & \", 0, NULL, C_T.\" &#REF! & \") AS \" &#REF! & \",\"","v":{"$error":"#REF!"}}]
[{"$f":"\"HTP.P('<\" &#REF! & \">' || \" & IF(MID(#REF!,1,4)=\"STUB\",\"NULL\",\"REC.\" &#REF!) & \" || '</\" &#REF! & \">');\"","v":{"$error":"#REF!"}},null,{"$f":"\"DECODE(C_T.\" &#REF! & \", 0, NULL, C_T.\" &#REF! & \") AS \" &#REF! & \",\"","v":{"$error":"#REF!"}}]
[{"$f":"\"HTP.P('<\" &#REF! & \">' || \" & IF(MID(#REF!,1,4)=\"STUB\",\"NULL\",\"REC.\" &#REF!) & \" || '</\" &#REF! & \">');\"","v":{"$error":"#REF!"}},null,{"$f":"\"DECODE(C_T.\" &#REF! & \", 0, NULL, C_T.\" &#REF! & \") AS \" &#REF! & \",\"","v":{"$error":"#REF!"}}]
[{"$f":"\"HTP.P('<\" &#REF! & \">' || \" & IF(MID(#REF!,1,4)=\"STUB\",\"NULL\",\"REC.\" &#REF!) & \" || '</\" &#REF! & \">');\"","v":{"$error":"#REF!"}},null,{"$f":"\"DECODE(C_T.\" &#REF! & \", 0, NULL, C_T.\" &#REF! & \") AS \" &#REF! & \",\"","v":{"$error":"#REF!"}}]
[{"$f":"\"HTP.P('<\" &#REF! & \">' || \" & IF(MID(#REF!,1,4)=\"STUB\",\"NULL\",\"REC.\" &#REF!) & \" || '</\" &#REF! & \">');\"","v":{"$error":"#REF!"}},null,{"$f":"\"DECODE(C_T.\" &#REF! & \", 0, NULL, C_T.\" &#REF! & \") AS \" &#REF! & \",\"","v":{"$error":"#REF!"}}]
[{"$f":"\"HTP.P('<\" &#REF! & \">' || \" & IF(MID(#REF!,1,4)=\"STUB\",\"NULL\",\"REC.\" &#REF!) & \" || '</\" &#REF! & \">');\"","v":{"$error":"#REF!"}},null,{"$f":"\"DECODE(C_T.\" &#REF! & \", 0, NULL, C_T.\" &#REF! & \") AS \" &#REF! & \",\"","v":{"$error":"#REF!"}}]
[{"$f":"\"HTP.P('<\" &#REF! & \">' || \" & IF(MID(#REF!,1,4)=\"STUB\",\"NULL\",\"REC.\" &#REF!) & \" || '</\" &#REF! & \">');\"","v":{"$error":"#REF!"}},null,{"$f":"\"DECODE(C_T.\" &#REF! & \", 0, NULL, C_T.\" &#REF! & \") AS \" &#REF! & \",\"","v":{"$error":"#REF!"}}]
[{"$f":"\"HTP.P('<\" &#REF! & \">' || \" & IF(MID(#REF!,1,4)=\"STUB\",\"NULL\",\"REC.\" &#REF!) & \" || '</\" &#REF! & \">');\"","v":{"$error":"#REF!"}},null,{"$f":"\"DECODE(C_T.\" &#REF! & \", 0, NULL, C_T.\" &#REF! & \") AS \" &#REF! & \",\"","v":{"$error":"#REF!"}}]
[{"$f":"\"HTP.P('<\" &#REF! & \">' || \" & IF(MID(#REF!,1,4)=\"STUB\",\"NULL\",\"REC.\" &#REF!) & \" || '</\" &#REF! & \">');\"","v":{"$error":"#REF!"}},null,{"$f":"\"DECODE(C_T.\" &#REF! & \", 0, NULL, C_T.\" &#REF! & \") AS \" &#REF! & \",\"","v":{"$error":"#REF!"}}]
[{"$f":"\"HTP.P('<\" &#REF! & \">' || \" & IF(MID(#REF!,1,4)=\"STUB\",\"NULL\",\"REC.\" &#REF!) & \" || '</\" &#REF! & \">');\"","v":{"$error":"#REF!"}},null,{"$f":"\"DECODE(C_T.\" &#REF! & \", 0, NULL, C_T.\" &#REF! & \") AS \" &#REF! & \",\"","v":{"$error":"#REF!"}}]
[{"$f":"\"HTP.P('<\" &#REF! & \">' || \" & IF(MID(#REF!,1,4)=\"STUB\",\"NULL\",\"REC.\" &#REF!) & \" || '</\" &#REF! & \">');\"","v":{"$error":"#REF!"}},null,{"$f":"\"DECODE(C_T.\" &#REF! & \", 0, NULL, C_T.\" &#REF! & \") AS \" &#REF! & \",\"","v":{"$error":"#REF!"}}]
[{"$f":"\"HTP.P('<\" &#REF! & \">' || \" & IF(MID(#REF!,1,4)=\"STUB\",\"NULL\",\"REC.\" &#REF!) & \" || '</\" &#REF! & \">');\"","v":{"$error":"#REF!"}},null,{"$f":"\"DECODE(C_T.\" &#REF! & \", 0, NULL, C_T.\" &#REF! & \") AS \" &#REF! & \",\"","v":{"$error":"#REF!"}}]
[{"$f":"\"HTP.P('<\" &#REF! & \">' || \" & IF(MID(#REF!,1,4)=\"STUB\",\"NULL\",\"REC.\" &#REF!) & \" || '</\" &#REF! & \">');\"","v":{"$error":"#REF!"}},null,{"$f":"\"DECODE(C_T.\" &#REF! & \", 0, NULL, C_T.\" &#REF! & \") AS \" &#REF! & \",\"","v":{"$error":"#REF!"}}]
[{"$f":"\"HTP.P('<\" &#REF! & \">' || \" & IF(MID(#REF!,1,4)=\"STUB\",\"NULL\",\"REC.\" &#REF!) & \" || '</\" &#REF! & \">');\"","v":{"$error":"#REF!"}},null,{"$f":"\"DECODE(C_T.\" &#REF! & \", 0, NULL, C_T.\" &#REF! & \") AS \" &#REF! & \",\"","v":{"$error":"#REF!"}}]
[{"$f":"\"HTP.P('<\" &#REF! & \">' || \" & IF(MID(#REF!,1,4)=\"STUB\",\"NULL\",\"REC.\" &#REF!) & \" || '</\" &#REF! & \">');\"","v":{"$error":"#REF!"}},null,{"$f":"\"DECODE(C_T.\" &#REF! & \", 0, NULL, C_T.\" &#REF! & \") AS \" &#REF! & \",\"","v":{"$error":"#REF!"}}]
[{"$f":"\"HTP.P('<\" &#REF! & \">' || \" & IF(MID(#REF!,1,4)=\"STUB\",\"NULL\",\"REC.\" &#REF!) & \" || '</\" &#REF! & \">');\"","v":{"$error":"#REF!"}},null,{"$f":"\"DECODE(C_T.\" &#REF! & \", 0, NULL, C_T.\" &#REF! & \") AS \" &#REF! & \",\"","v":{"$error":"#REF!"}}]
[{"$f":"\"HTP.P('<\" &#REF! & \">' || \" & IF(MID(#REF!,1,4)=\"STUB\",\"NULL\",\"REC.\" &#REF!) & \" || '</\" &#REF! & \">');\"","v":{"$error":"#REF!"}},null,{"$f":"\"DECODE(C_T.\" &#REF! & \", 0, NULL, C_T.\" &#REF! & \") AS \" &#REF! & \",\"","v":{"$error":"#REF!"}}]
[{"$f":"\"HTP.P('<\" &#REF! & \">' || \" & IF(MID(#REF!,1,4)=\"STUB\",\"NULL\",\"REC.\" &#REF!) & \" || '</\" &#REF! & \">');\"","v":{"$error":"#REF!"}},null,{"$f":"\"DECODE(C_T.\" &#REF! & \", 0, NULL, C_T.\" &#REF! & \") AS \" &#REF! & \",\"","v":{"$error":"#REF!"}}]
[{"$f":"\"HTP.P('<\" &#REF! & \">' || \" & IF(MID(#REF!,1,4)=\"STUB\",\"NULL\",\"REC.\" &#REF!) & \" || '</\" &#REF! & \">');\"","v":{"$error":"#REF!"}},null,{"$f":"\"DECODE(C_T.\" &#REF! & \", 0, NULL, C_T.\" &#REF! & \") AS \" &#REF! & \",\"","v":{"$error":"#REF!"}}]
[{"$f":"\"HTP.P('<\" &#REF! & \">' || \" & IF(MID(#REF!,1,4)=\"STUB\",\"NULL\",\"REC.\" &#REF!) & \" || '</\" &#REF! & \">');\"","v":{"$error":"#REF!"}},null,{"$f":"\"DECODE(C_T.\" &#REF! & \", 0, NULL, C_T.\" &#REF! & \") AS \" &#REF! & \",\"","v":{"$error":"#REF!"}}]
[{"$f":"\"HTP.P('<\" &#REF! & \">' || \" & IF(MID(#REF!,1,4)=\"STUB\",\"NULL\",\"REC.\" &#REF!) & \" || '</\" &#REF! & \">');\"","v":{"$error":"#REF!"}},null,{"$f":"\"DECODE(C_T.\" &#REF! & \", 0, NULL, C_T.\" &#REF! & \") AS \" &#REF! & \",\"","v":{"$error":"#REF!"}}]
[{"$f":"\"HTP.P('<\" &#REF! & \">' || \" & IF(MID(#REF!,1,4)=\"STUB\",\"NULL\",\"REC.\" &#REF!) & \" || '</\" &#REF! & \">');\"","v":{"$error":"#REF!"}},null,{"$f":"\"DECODE(C_T.\" &#REF! & \", 0, NULL, C_T.\" &#REF! & \") AS \" &#REF! & \",\"","v":{"$error":"#REF!"}}]
[{"$f":"\"HTP.P('<\" &#REF! & \">' || \" & IF(MID(#REF!,1,4)=\"STUB\",\"NULL\",\"REC.\" &#REF!) & \" || '</\" &#REF! & \">');\"","v":{"$error":"#REF!"}},null,{"$f":"\"DECODE(C_T.\" &#REF! & \", 0, NULL, C_T.\" &#REF! & \") AS \" &#REF! & \",\"","v":{"$error":"#REF!"}}]
[{"$f":"\"HTP.P('<\" &#REF! & \">' || \" & IF(MID(#REF!,1,4)=\"STUB\",\"NULL\",\"REC.\" &#REF!) & \" || '</\" &#REF! & \">');\"","v":{"$error":"#REF!"}},null,{"$f":"\"DECODE(C_T.\" &#REF! & \", 0, NULL, C_T.\" &#REF! & \") AS \" &#REF! & \",\"","v":{"$error":"#REF!"}}]
[{"$f":"\"HTP.P('<\" &#REF! & \">' || \" & IF(MID(#REF!,1,4)=\"STUB\",\"NULL\",\"REC.\" &#REF!) & \" || '</\" &#REF! & \">');\"","v":{"$error":"#REF!"}},null,{"$f":"\"DECODE(C_T.\" &#REF! & \", 0, NULL, C_T.\" &#REF! & \") AS \" &#REF! & \",\"","v":{"$error":"#REF!"}}]
[{"$f":"\"HTP.P('<\" &#REF! & \">' || \" & IF(MID(#REF!,1,4)=\"STUB\",\"NULL\",\"REC.\" &#REF!) & \" || '</\" &#REF! & \">');\"","v":{"$error":"#REF!"}},null,{"$f":"\"DECODE(C_T.\" &#REF! & \", 0, NULL, C_T.\" &#REF! & \") AS \" &#REF! & \",\"","v":{"$error":"#REF!"}}]
[{"$f":"\"HTP.P('<\" & I385 & \">' || \" & IF(MID(I385,1,4)=\"STUB\",\"NULL\",\"REC.\" & I385) & \" || '</\" & I385 & \">');\"","v":"HTP.P('<>' || REC. || '</>');"},null,{"$f":"\"DECODE(C_T.\" & I385 & \", 0, NULL, C_T.\" & I385 & \") AS \" & I385 & \",\"","v":"DECODE(C_T., 0, NULL, C_T.) AS ,"}]
[{"$f":"\"HTP.P('<\" & I386 & \">' || \" & IF(MID(I386,1,4)=\"STUB\",\"NULL\",\"REC.\" & I386) & \" || '</\" & I386 & \">');\"","v":"HTP.P('<>' || REC. || '</>');"},null,{"$f":"\"DECODE(C_T.\" & I386 & \", 0, NULL, C_T.\" & I386 & \") AS \" & I386 & \",\"","v":"DECODE(C_T., 0, NULL, C_T.) AS ,"}]
[{"$f":"\"HTP.P('<\" & I422 & \">' || \" & IF(MID(I422,1,4)=\"STUB\",\"NULL\",\"REC.\" & I422) & \" || '</\" & I422 & \">');\"","v":"HTP.P('<>' || REC. || '</>');"},null,{"$f":"\"DECODE(C_T.\" & I422 & \", 0, NULL, C_T.\" & I422 & \") AS \" & I422 & \",\"","v":"DECODE(C_T., 0, NULL, C_T.) AS ,"}]
["HTP.P('<>' || REC. || '</>');",null,"DECODE(C_T., 0, NULL, C_T.) AS ,"]
["HTP.P('<>' || REC. || '</>');",null,"DECODE(C_T., 0, NULL, C_T.) AS ,"]
["HTP.P('<>' || REC. || '</>');",null,"DECODE(C_T., 0, NULL, C_T.) AS ,"]
["HTP.P('<>' || REC. || '</>');",null,"DECODE(C_T., 0, NULL, C_T.) AS ,"]
["HTP.P('<>' || REC. || '</>');",null,"DECODE(C_T., 0, NULL, C_T.) AS ,"]
["HTP.P('<>' || REC. || '</>');",null,"DECODE(C_T., 0, NULL, C_T.) AS ,"]
["HTP.P('<>' || REC. || '</>');",null,"DECODE(C_T., 0, NULL, C_T.) AS ,"]
["HTP.P('<>' || REC. || '</>');",null,"DECODE(C_T., 0, NULL, C_T.) AS ,"]
["HTP.P('<>' || REC. || '</>');",null,"DECODE(C_T., 0, NULL, C_T.) AS ,"]
["HTP.P('<>' || REC. || '</>');",null,"DECODE(C_T., 0, NULL, C_T.) AS ,"]
["HTP.P('<>' || REC. || '</>');",null,"DECODE(C_T., 0, NULL, C_T.) AS ,"]
["HTP.P('<>' || REC. || '</>');",null,"DECODE(C_T., 0, NULL, C_T.) AS ,"]
["HTP.P('<>' || REC. || '</>');",null,"DECODE(C_T., 0, NULL, C_T.) AS ,"]
["HTP.P('<>' || REC. || '</>');",null,"DECODE(C_T., 0, NULL, C_T.) AS ,"]
["HTP.P('<>' || REC. || '</>');",null,"DECODE(C_T., 0, NULL, C_T.) AS ,"]
["HTP.P('<>' || REC. || '</>');",null,"DECODE(C_T., 0, NULL, C_T.) AS ,"]
["HTP.P('<>' || REC. || '</>');",null,"DECODE(C_T., 0, NULL, C_T.) AS ,"]
["HTP.P('<>' || REC. || '</>');",null,"DECODE(C_T., 0, NULL, C_T.) AS ,"]
[{"$f":"\"HTP.P('<\" & I441 & \">' || \" & IF(MID(I441,1,4)=\"STUB\",\"NULL\",\"REC.\" & I441) & \" || '</\" & I441 & \">');\"","v":"HTP.P('<>' || REC. || '</>');"},null,{"$f":"\"DECODE(C_T.\" & I441 & \", 0, NULL, C_T.\" & I441 & \") AS \" & I441 & \",\"","v":"DECODE(C_T., 0, NULL, C_T.) AS ,"}]
["HTP.P('<>' || REC. || '</>');",null,"DECODE(C_T., 0, NULL, C_T.) AS ,"]
["HTP.P('<>' || REC. || '</>');",null,"DECODE(C_T., 0, NULL, C_T.) AS ,"]
["HTP.P('<>' || REC. || '</>');",null,"DECODE(C_T., 0, NULL, C_T.) AS ,"]
["HTP.P('<>' || REC. || '</>');",null,"DECODE(C_T., 0, NULL, C_T.) AS ,"]
["HTP.P('<>' || REC. || '</>');",null,"DECODE(C_T., 0, NULL, C_T.) AS ,"]
["HTP.P('<>' || REC. || '</>');",null,"DECODE(C_T., 0, NULL, C_T.) AS ,"]
["HTP.P('<>' || REC. || '</>');",null,"DECODE(C_T., 0, NULL, C_T.) AS ,"]
["HTP.P('<>' || REC. || '</>');",null,"DECODE(C_T., 0, NULL, C_T.) AS ,"]
["HTP.P('<>' || REC. || '</>');",null,"DECODE(C_T., 0, NULL, C_T.) AS ,"]
["HTP.P('<>' || REC. || '</>');",null,"DECODE(C_T., 0, NULL, C_T.) AS ,"]
["HTP.P('<>' || REC. || '</>');",null,"DECODE(C_T., 0, NULL, C_T.) AS ,"]
["HTP.P('<>' || REC. || '</>');",null,"DECODE(C_T., 0, NULL, C_T.) AS ,"]
["HTP.P('<>' || REC. || '</>');",null,"DECODE(C_T., 0, NULL, C_T.) AS ,"]
["HTP.P('<>' || REC. || '</>');",null,"DECODE(C_T., 0, NULL, C_T.) AS ,"]
["HTP.P('<>' || REC. || '</>');",null,"DECODE(C_T., 0, NULL, C_T.) AS ,"]
["HTP.P('<>' || REC. || '</>');",null,"DECODE(C_T., 0, NULL, C_T.) AS ,"]
["HTP.P('<>' || REC. || '</>');",null,"DECODE(C_T., 0, NULL, C_T.) AS ,"]
["HTP.P('<>' || REC. || '</>');",null,"DECODE(C_T., 0, NULL, C_T.) AS ,"]
["HTP.P('<>' || REC. || '</>');",null,"DECODE(C_T., 0, NULL, C_T.) AS ,"]
["HTP.P('<>' || REC. || '</>');",null,"DECODE(C_T., 0, NULL, C_T.) AS ,"]
["HTP.P('<>' || REC. || '</>');",null,"DECODE(C_T., 0, NULL, C_T.) AS ,"]
["HTP.P('<>' || REC. || '</>');",null,"DECODE(C_T., 0, NULL, C_T.) AS ,"]
["HTP.P('<>' || REC. || '</>');",null,"DECODE(C_T., 0, NULL, C_T.) AS ,"]
["HTP.P('<>' || REC. || '</>');",null,"DECODE(C_T., 0, NULL, C_T.) AS ,"]
["HTP.P('<>' || REC. || '</>');",null,"DECODE(C_T., 0, NULL, C_T.) AS ,"]
["HTP.P('<>' || REC. || '</>');",null,"DECODE(C_T., 0, NULL, C_T.) AS ,"]
["HTP.P('<>' || REC. || '</>');",null,"DECODE(C_T., 0, NULL, C_T.) AS ,"]
["HTP.P('<>' || REC. || '</>');",null,"DECODE(C_T., 0, NULL, C_T.) AS ,"]
["HTP.P('<>' || REC. || '</>');",null,"DECODE(C_T., 0, NULL, C_T.) AS ,"]
["HTP.P('<>' || REC. || '</>');",null,"DECODE(C_T., 0, NULL, C_T.) AS ,"]
["HTP.P('<>' || REC. || '</>');",null,"DECODE(C_T., 0, NULL, C_T.) AS ,"]
["HTP.P('<>' || REC. || '</>');",null,"DECODE(C_T., 0, NULL, C_T.) AS ,"]
["HTP.P('<>' || REC. || '</>');",null,"DECODE(C_T., 0, NULL, C_T.) AS ,"]
["HTP.P('<>' || REC. || '</>');",null,"DECODE(C_T., 0, NULL, C_T.) AS ,"]
["HTP.P('<>' || REC. || '</>');",null,"DECODE(C_T., 0, NULL, C_T.) AS ,"]
["HTP.P('<>' || REC. || '</>');",null,"DECODE(C_T., 0, NULL, C_T.) AS ,"]
["HTP.P('<>' || REC. || '</>');",null,"DECODE(C_T., 0, NULL, C_T.) AS ,"]
["HTP.P('<>' || REC. || '</>');",null,"DECODE(C_T., 0, NULL, C_T.) AS ,"]
["HTP.P('<>' || REC. || '</>');",null,"DECODE(C_T., 0, NULL, C_T.) AS ,"]
["HTP.P('<>' || REC. || '</>');",null,"DECODE(C_T., 0, NULL, C_T.) AS ,"]
["HTP.P('<>' || REC. || '</>');",null,"DECODE(C_T., 0, NULL, C_T.) AS ,"]
["HTP.P('<>' || REC. || '</>');",null,"DECODE(C_T., 0, NULL, C_T.) AS ,"]
["HTP.P('<>' || REC. || '</>');",null,"DECODE(C_T., 0, NULL, C_T.) AS ,"]
["HTP.P('<>' || REC. || '</>');",null,"DECODE(C_T., 0, NULL, C_T.) AS ,"]
["HTP.P('<>' || REC. || '</>');",null,"DECODE(C_T., 0, NULL, C_T.) AS ,"]
["HTP.P('<>' || REC. || '</>');",null,"DECODE(C_T., 0, NULL, C_T.) AS ,"]
["HTP.P('<>' || REC. || '</>');",null,"DECODE(C_T., 0, NULL, C_T.) AS ,"]
["HTP.P('<>' || REC. || '</>');",null,"DECODE(C_T., 0, NULL, C_T.) AS ,"]
["HTP.P('<>' || REC. || '</>');",null,"DECODE(C_T., 0, NULL, C_T.) AS ,"]
["HTP.P('<>' || REC. || '</>');",null,"DECODE(C_T., 0, NULL, C_T.) AS ,"]
["HTP.P('<>' || REC. || '</>');",null,"DECODE(C_T., 0, NULL, C_T.) AS ,"]
["HTP.P('<>' || REC. || '</>');",null,"DECODE(C_T., 0, NULL, C_T.) AS ,"]
["HTP.P('<>' || REC. || '</>');",null,"DECODE(C_T., 0, NULL, C_T.) AS ,"]
["HTP.P('<>' || REC. || '</>');",null,"DECODE(C_T., 0, NULL, C_T.) AS ,"]
["HTP.P('<>' || REC. || '</>');",null,"DECODE(C_T., 0, NULL, C_T.) AS ,"]
["HTP.P('<>' || REC. || '</>');",null,"DECODE(C_T., 0, NULL, C_T.) AS ,"]
["HTP.P('<>' || REC. || '</>');",null,"DECODE(C_T., 0, NULL, C_T.) AS ,"]
["HTP.P('<>' || REC. || '</>');",null,"DECODE(C_T., 0, NULL, C_T.) AS ,"]
["HTP.P('<>' || REC. || '</>');",null,"DECODE(C_T., 0, NULL, C_T.) AS ,"]
["HTP.P('<>' || REC. || '</>');",null,"DECODE(C_T., 0, NULL, C_T.) AS ,"]
[]
[]
[]
[]
[]
[]
[{"$f":"\"HTP.P('<\" & I508 & \">' || \" & IF(MID(I508,1,6)=\"L_STUB\",\"NULL\",\"REC.\" & I508) & \" || '</\" & I508 & \">');\"","v":"HTP.P('<>' || REC. || '</>');"},null,{"$f":"\"DECODE(C_T.\" & I508 & \", 0, NULL, C_T.\" & I508 & \") AS \" & I508 & \",\"","v":"DECODE(C_T., 0, NULL, C_T.) AS ,"}]
[{"$f":"\"HTP.P('<\" & I509 & \">' || \" & IF(MID(I509,1,6)=\"L_STUB\",\"NULL\",\"REC.\" & I509) & \" || '</\" & I509 & \">');\"","v":"HTP.P('<>' || REC. || '</>');"},null,{"$f":"\"DECODE(C_T.\" & I509 & \", 0, NULL, C_T.\" & I509 & \") AS \" & I509 & \",\"","v":"DECODE(C_T., 0, NULL, C_T.) AS ,"}]
["HTP.P('<>' || REC. || '</>');",null,"DECODE(C_T., 0, NULL, C_T.) AS ,"]
["HTP.P('<>' || REC. || '</>');",null,"DECODE(C_T., 0, NULL, C_T.) AS ,"]
["HTP.P('<>' || REC. || '</>');",null,"DECODE(C_T., 0, NULL, C_T.) AS ,"]
["HTP.P('<>' || REC. || '</>');",null,"DECODE(C_T., 0, NULL, C_T.) AS ,"]
["HTP.P('<>' || REC. || '</>');",null,"DECODE(C_T., 0, NULL, C_T.) AS ,"]
["HTP.P('<>' || REC. || '</>');",null,"DECODE(C_T., 0, NULL, C_T.) AS ,"]
["HTP.P('<>' || REC. || '</>');",null,"DECODE(C_T., 0, NULL, C_T.) AS ,"]
["HTP.P('<>' || REC. || '</>');",null,"DECODE(C_T., 0, NULL, C_T.) AS ,"]
["HTP.P('<>' || REC. || '</>');",null,"DECODE(C_T., 0, NULL, C_T.) AS ,"]
["HTP.P('<>' || REC. || '</>');",null,"DECODE(C_T., 0, NULL, C_T.) AS ,"]
["HTP.P('<>' || REC. || '</>');",null,"DECODE(C_T., 0, NULL, C_T.) AS ,"]
["HTP.P('<>' || REC. || '</>');",null,"DECODE(C_T., 0, NULL, C_T.) AS ,"]
["HTP.P('<>' || REC. || '</>');",null,"DECODE(C_T., 0, NULL, C_T.) AS ,"]
["HTP.P('<>' || REC. || '</>');",null,"DECODE(C_T., 0, NULL, C_T.) AS ,"]
["HTP.P('<>' || REC. || '</>');",null,"DECODE(C_T., 0, NULL, C_T.) AS ,"]
["HTP.P('<>' || REC. || '</>');",null,"DECODE(C_T., 0, NULL, C_T.) AS ,"]
["HTP.P('<>' || REC. || '</>');",null,"DECODE(C_T., 0, NULL, C_T.) AS ,"]
["HTP.P('<>' || REC. || '</>');",null,"DECODE(C_T., 0, NULL, C_T.) AS ,"]
["HTP.P('<>' || REC. || '</>');",null,"DECODE(C_T., 0, NULL, C_T.) AS ,"]
["HTP.P('<>' || REC. || '</>');",null,"DECODE(C_T., 0, NULL, C_T.) AS ,"]
["HTP.P('<>' || REC. || '</>');",null,"DECODE(C_T., 0, NULL, C_T.) AS ,"]
["HTP.P('<>' || REC. || '</>');",null,"DECODE(C_T., 0, NULL, C_T.) AS ,"]
["HTP.P('<>' || REC. || '</>');",null,"DECODE(C_T., 0, NULL, C_T.) AS ,"]
["HTP.P('<>' || REC. || '</>');",null,"DECODE(C_T., 0, NULL, C_T.) AS ,"]
["HTP.P('<>' || REC. || '</>');",null,"DECODE(C_T., 0, NULL, C_T.) AS ,"]
["HTP.P('<>' || REC. || '</>');",null,"DECODE(C_T., 0, NULL, C_T.) AS ,"]
["HTP.P('<>' || REC. || '</>');",null,"DECODE(C_T., 0, NULL, C_T.) AS ,"]
["HTP.P('<>' || REC. || '</>');",null,"DECODE(C_T., 0, NULL, C_T.) AS ,"]
["HTP.P('<>' || REC. || '</>');",null,"DECODE(C_T., 0, NULL, C_T.) AS ,"]
["HTP.P('<>' || REC. || '</>');",null,"DECODE(C_T., 0, NULL, C_T.) AS ,"]
["HTP.P('<>' || REC. || '</>');",null,"DECODE(C_T., 0, NULL, C_T.) AS ,"]
["HTP.P('<>' || REC. || '</>');",null,"DECODE(C_T., 0, NULL, C_T.) AS ,"]
["HTP.P('<>' || REC. || '</>');",null,"DECODE(C_T., 0, NULL, C_T.) AS ,"]
["HTP.P('<>' || REC. || '</>');",null,"DECODE(C_T., 0, NULL, C_T.) AS ,"]
["HTP.P('<>' || REC. || '</>');",null,"DECODE(C_T., 0, NULL, C_T.) AS ,"]
["HTP.P('<>' || REC. || '</>');",null,"DECODE(C_T., 0, NULL, C_T.) AS ,"]
["HTP.P('<>' || REC. || '</>');",null,"DECODE(C_T., 0, NULL, C_T.) AS ,"]
["HTP.P('<>' || REC. || '</>');",null,"DECODE(C_T., 0, NULL, C_T.) AS ,"]
["HTP.P('<>' || REC. || '</>');",null,"DECODE(C_T., 0, NULL, C_T.) AS ,"]
["HTP.P('<>' || REC. || '</>');",null,"DECODE(C_T., 0, NULL, C_T.) AS ,"]
["HTP.P('<>' || REC. || '</>');",null,"DECODE(C_T., 0, NULL, C_T.) AS ,"]
["HTP.P('<>' || REC. || '</>');",null,"DECODE(C_T., 0, NULL, C_T.) AS ,"]
["HTP.P('<>' || REC. || '</>');",null,"DECODE(C_T., 0, NULL, C_T.) AS ,"]
["HTP.P('<>' || REC. || '</>');",null,"DECODE(C_T., 0, NULL, C_T.) AS ,"]
["HTP.P('<>' || REC. || '</>');",null,"DECODE(C_T., 0, NULL, C_T.) AS ,"]
["HTP.P('<>' || REC. || '</>');",null,"DECODE(C_T., 0, NULL, C_T.) AS ,"]
["HTP.P('<>' || REC. || '</>');",null,"DECODE(C_T., 0, NULL, C_T.) AS ,"]
["HTP.P('<>' || REC. || '</>');",null,"DECODE(C_T., 0, NULL, C_T.) AS ,"]
["HTP.P('<>' || REC. || '</>');",null,"DECODE(C_T., 0, NULL, C_T.) AS ,"]
["HTP.P('<>' || REC. || '</>');",null,"DECODE(C_T., 0, NULL, C_T.) AS ,"]
["HTP.P('<>' || REC. || '</>');",null,"DECODE(C_T., 0, NULL, C_T.) AS ,"]
["HTP.P('<>' || REC. || '</>');",null,"DECODE(C_T., 0, NULL, C_T.) AS ,"]
["HTP.P('<>' || REC. || '</>');",null,"DECODE(C_T., 0, NULL, C_T.) AS ,"]
["HTP.P('<>' || REC. || '</>');",null,"DECODE(C_T., 0, NULL, C_T.) AS ,"]
["HTP.P('<>' || REC. || '</>');",null,"DECODE(C_T., 0, NULL, C_T.) AS ,"]
["HTP.P('<>' || REC. || '</>');",null,"DECODE(C_T., 0, NULL, C_T.) AS ,"]
["HTP.P('<>' || REC. || '</>');",null,"DECODE(C_T., 0, NULL, C_T.) AS ,"]
["HTP.P('<>' || REC. || '</>');",null,"DECODE(C_T., 0, NULL, C_T.) AS ,"]
["HTP.P('<>' || REC. || '</>');",null,"DECODE(C_T., 0, NULL, C_T.) AS ,"]
["HTP.P('<>' || REC. || '</>');",null,"DECODE(C_T., 0, NULL, C_T.) AS ,"]
["HTP.P('<>' || REC. || '</>');",null,"DECODE(C_T., 0, NULL, C_T.) AS ,"]
["HTP.P('<>' || REC. || '</>');",null,"DECODE(C_T., 0, NULL, C_T.) AS ,"]
["HTP.P('<>' || REC. || '</>');",null,"DECODE(C_T., 0, NULL, C_T.) AS ,"]
[{"$f":"\"HTP.P('<\" & I573 & \">' || \" & IF(MID(I573,1,6)=\"L_STUB\",\"NULL\",\"REC.\" & I573) & \" || '</\" & I573 & \">');\"","v":"HTP.P('<>' || REC. || '</>');"},null,{"$f":"\"DECODE(C_T.\" & I573 & \", 0, NULL, C_T.\" & I573 & \") AS \" & I573 & \",\"","v":"DECODE(C_T., 0, NULL, C_T.) AS ,"}]
["HTP.P('<>' || REC. || '</>');",null,"DECODE(C_T., 0, NULL, C_T.) AS ,"]
["HTP.P('<>' || REC. || '</>');",null,"DECODE(C_T., 0, NULL, C_T.) AS ,"]
["HTP.P('<>' || REC. || '</>');",null,"DECODE(C_T., 0, NULL, C_T.) AS ,"]
["HTP.P('<>' || REC. || '</>');",null,"DECODE(C_T., 0, NULL, C_T.) AS ,"]
["HTP.P('<>' || REC. || '</>');",null,"DECODE(C_T., 0, NULL, C_T.) AS ,"]
["HTP.P('<>' || REC. || '</>');",null,"DECODE(C_T., 0, NULL, C_T.) AS ,"]
["HTP.P('<>' || REC. || '</>');",null,"DECODE(C_T., 0, NULL, C_T.) AS ,"]
["HTP.P('<>' || REC. || '</>');",null,"DECODE(C_T., 0, NULL, C_T.) AS ,"]
["HTP.P('<>' || REC. || '</>');",null,"DECODE(C_T., 0, NULL, C_T.) AS ,"]
["HTP.P('<>' || REC. || '</>');",null,"DECODE(C_T., 0, NULL, C_T.) AS ,"]
["HTP.P('<>' || REC. || '</>');",null,"DECODE(C_T., 0, NULL, C_T.) AS ,"]
["HTP.P('<>' || REC. || '</>');",null,"DECODE(C_T., 0, NULL, C_T.) AS ,"]
["HTP.P('<>' || REC. || '</>');",null,"DECODE(C_T., 0, NULL, C_T.) AS ,"]
["HTP.P('<>' || REC. || '</>');",null,"DECODE(C_T., 0, NULL, C_T.) AS ,"]
["HTP.P('<>' || REC. || '</>');",null,"DECODE(C_T., 0, NULL, C_T.) AS ,"]
["HTP.P('<>' || REC. || '</>');",null,"DECODE(C_T., 0, NULL, C_T.) AS ,"]
["HTP.P('<>' || REC. || '</>');",null,"DECODE(C_T., 0, NULL, C_T.) AS ,"]
["HTP.P('<>' || REC. || '</>');",null,"DECODE(C_T., 0, NULL, C_T.) AS ,"]
["HTP.P('<>' || REC. || '</>');",null,"DECODE(C_T., 0, NULL, C_T.) AS ,"]
["HTP.P('<>' || REC. || '</>');",null,"DECODE(C_T., 0, NULL, C_T.) AS ,"]
["HTP.P('<>' || REC. || '</>');",null,"DECODE(C_T., 0, NULL, C_T.) AS ,"]
["HTP.P('<>' || REC. || '</>');",null,"DECODE(C_T., 0, NULL, C_T.) AS ,"]
["HTP.P('<>' || REC. || '</>');",null,"DECODE(C_T., 0, NULL, C_T.) AS ,"]
["HTP.P('<>' || REC. || '</>');",null,"DECODE(C_T., 0, NULL, C_T.) AS ,"]
["HTP.P('<>' || REC. || '</>');",null,"DECODE(C_T., 0, NULL, C_T.) AS ,"]
["HTP.P('<>' || REC. || '</>');",null,"DECODE(C_T., 0, NULL, C_T.) AS ,"]
["HTP.P('<>' || REC. || '</>');",null,"DECODE(C_T., 0, NULL, C_T.) AS ,"]
["HTP.P('<>' || REC. || '</>');",null,"DECODE(C_T., 0, NULL, C_T.) AS ,"]
["HTP.P('<>' || REC. || '</>');",null,"DECODE(C_T., 0, NULL, C_T.) AS ,"]
["HTP.P('<>' || REC. || '</>');",null,"DECODE(C_T., 0, NULL, C_T.) AS ,"]
["HTP.P('<>' || REC. || '</>');",null,"DECODE(C_T., 0, NULL, C_T.) AS ,"]
["HTP.P('<>' || REC. || '</>');",null,"DECODE(C_T., 0, NULL, C_T.) AS ,"]
["HTP.P('<>' || REC. || '</>');",null,"DECODE(C_T., 0, NULL, C_T.) AS ,"]
["HTP.P('<>' || REC. || '</>');",null,"DECODE(C_T., 0, NULL, C_T.) AS ,"]
["HTP.P('<>' || REC. || '</>');",null,"DECODE(C_T., 0, NULL, C_T.) AS ,"]
["HTP.P('<>' || REC. || '</>');",null,"DECODE(C_T., 0, NULL, C_T.) AS ,"]
["HTP.P('<>' || REC. || '</>');",null,"DECODE(C_T., 0, NULL, C_T.) AS ,"]
["HTP.P('<>' || REC. || '</>');",null,"DECODE(C_T., 0, NULL, C_T.) AS ,"]
["HTP.P('<>' || REC. || '</>');",null,"DECODE(C_T., 0, NULL, C_T.) AS ,"]
["HTP.P('<>' || REC. || '</>');",null,"DECODE(C_T., 0, NULL, C_T.) AS ,"]
["HTP.P('<>' || REC. || '</>');",null,"DECODE(C_T., 0, NULL, C_T.) AS ,"]
["HTP.P('<>' || REC. || '</>');",null,"DECODE(C_T., 0, NULL, C_T.) AS ,"]
["HTP.P('<>' || REC. || '</>');",null,"DECODE(C_T., 0, NULL, C_T.) AS ,"]
["HTP.P('<>' || REC. || '</>');",null,"DECODE(C_T., 0, NULL, C_T.) AS ,"]
["HTP.P('<>' || REC. || '</>');",null,"DECODE(C_T., 0, NULL, C_T.) AS ,"]
[]
[]
[]
[]
[]
[]
[{"$f":"\"HTP.P('<\" & I625 & \">' || \" & IF(MID(I625,1,6)=\"L_STUB\",\"NULL\",\"REC.\" & I625) & \" || '</\" & I625 & \">');\"","v":"HTP.P('<>' || REC. || '</>');"},null,{"$f":"\"DECODE(C_T.\" & I625 & \", 0, NULL, C_T.\" & I625 & \") AS \" & I625 & \",\"","v":"DECODE(C_T., 0, NULL, C_T.) AS ,"}]
[{"$f":"\"HTP.P('<\" & I626 & \">' || \" & IF(MID(I626,1,6)=\"L_STUB\",\"NULL\",\"REC.\" & I626) & \" || '</\" & I626 & \">');\"","v":"HTP.P('<>' || REC. || '</>');"},null,{"$f":"\"DECODE(C_T.\" & I626 & \", 0, NULL, C_T.\" & I626 & \") AS \" & I626 & \",\"","v":"DECODE(C_T., 0, NULL, C_T.) AS ,"}]
["HTP.P('<>' || REC. || '</>');",null,"DECODE(C_T., 0, NULL, C_T.) AS ,"]
["HTP.P('<>' || REC. || '</>');",null,"DECODE(C_T., 0, NULL, C_T.) AS ,"]
["HTP.P('<>' || REC. || '</>');",null,"DECODE(C_T., 0, NULL, C_T.) AS ,"]
["HTP.P('<>' || REC. || '</>');",null,"DECODE(C_T., 0, NULL, C_T.) AS ,"]
["HTP.P('<>' || REC. || '</>');",null,"DECODE(C_T., 0, NULL, C_T.) AS ,"]
["HTP.P('<>' || REC. || '</>');",null,"DECODE(C_T., 0, NULL, C_T.) AS ,"]
["HTP.P('<>' || REC. || '</>');",null,"DECODE(C_T., 0, NULL, C_T.) AS ,"]
["HTP.P('<>' || REC. || '</>');",null,"DECODE(C_T., 0, NULL, C_T.) AS ,"]
["HTP.P('<>' || REC. || '</>');",null,"DECODE(C_T., 0, NULL, C_T.) AS ,"]
["HTP.P('<>' || REC. || '</>');",null,"DECODE(C_T., 0, NULL, C_T.) AS ,"]
["HTP.P('<>' || REC. || '</>');",null,"DECODE(C_T., 0, NULL, C_T.) AS ,"]
["HTP.P('<>' || REC. || '</>');",null,"DECODE(C_T., 0, NULL, C_T.) AS ,"]
["HTP.P('<>' || REC. || '</>');",null,"DECODE(C_T., 0, NULL, C_T.) AS ,"]
["HTP.P('<>' || REC. || '</>');",null,"DECODE(C_T., 0, NULL, C_T.) AS ,"]
["HTP.P('<>' || REC. || '</>');",null,"DECODE(C_T., 0, NULL, C_T.) AS ,"]
["HTP.P('<>' || REC. || '</>');",null,"DECODE(C_T., 0, NULL, C_T.) AS ,"]
["HTP.P('<>' || REC. || '</>');",null,"DECODE(C_T., 0, NULL, C_T.) AS ,"]
["HTP.P('<>' || REC. || '</>');",null,"DECODE(C_T., 0, NULL, C_T.) AS ,"]
["HTP.P('<>' || REC. || '</>');",null,"DECODE(C_T., 0, NULL, C_T.) AS ,"]
["HTP.P('<>' || REC. || '</>');",null,"DECODE(C_T., 0, NULL, C_T.) AS ,"]
["HTP.P('<>' || REC. || '</>');",null,"DECODE(C_T., 0, NULL, C_T.) AS ,"]
["HTP.P('<>' || REC. || '</>');",null,"DECODE(C_T., 0, NULL, C_T.) AS ,"]
["HTP.P('<>' || REC. || '</>');",null,"DECODE(C_T., 0, NULL, C_T.) AS ,"]
["HTP.P('<>' || REC. || '</>');",null,"DECODE(C_T., 0, NULL, C_T.) AS ,"]
["HTP.P('<>' || REC. || '</>');",null,"DECODE(C_T., 0, NULL, C_T.) AS ,"]
["HTP.P('<>' || REC. || '</>');",null,"DECODE(C_T., 0, NULL, C_T.) AS ,"]
["HTP.P('<>' || REC. || '</>');",null,"DECODE(C_T., 0, NULL, C_T.) AS ,"]
["HTP.P('<>' || REC. || '</>');",null,"DECODE(C_T., 0, NULL, C_T.) AS ,"]
["HTP.P('<>' || REC. || '</>');",null,"DECODE(C_T., 0, NULL, C_T.) AS ,"]
["HTP.P('<>' || REC. || '</>');",null,"DECODE(C_T., 0, NULL, C_T.) AS ,"]
["HTP.P('<>' || REC. || '</>');",null,"DECODE(C_T., 0, NULL, C_T.) AS ,"]
["HTP.P('<>' || REC. || '</>');",null,"DECODE(C_T., 0, NULL, C_T.) AS ,"]
["HTP.P('<>' || REC. || '</>');",null,"DECODE(C_T., 0, NULL, C_T.) AS ,"]
["HTP.P('<>' || REC. || '</>');",null,"DECODE(C_T., 0, NULL, C_T.) AS ,"]
["HTP.P('<>' || REC. || '</>');",null,"DECODE(C_T., 0, NULL, C_T.) AS ,"]
["HTP.P('<>' || REC. || '</>');",null,"DECODE(C_T., 0, NULL, C_T.) AS ,"]
["HTP.P('<>' || REC. || '</>');",null,"DECODE(C_T., 0, NULL, C_T.) AS ,"]
["HTP.P('<>' || REC. || '</>');",null,"DECODE(C_T., 0, NULL, C_T.) AS ,"]
["HTP.P('<>' || REC. || '</>');",null,"DECODE(C_T., 0, NULL, C_T.) AS ,"]
["HTP.P('<>' || REC. || '</>');",null,"DECODE(C_T., 0, NULL, C_T.) AS ,"]
["HTP.P('<>' || REC. || '</>');",null,"DECODE(C_T., 0, NULL, C_T.) AS ,"]
["HTP.P('<>' || REC. || '</>');",null,"DECODE(C_T., 0, NULL, C_T.) AS ,"]
["HTP.P('<>' || REC. || '</>');",null,"DECODE(C_T., 0, NULL, C_T.) AS ,"]
["HTP.P('<>' || REC. || '</>');",null,"DECODE(C_T., 0, NULL, C_T.) AS ,"]
["HTP.P('<>' || REC. || '</>');",null,"DECODE(C_T., 0, NULL, C_T.) AS ,"]
["HTP.P('<>' || REC. || '</>');",null,"DECODE(C_T., 0, NULL, C_T.) AS ,"]
["HTP.P('<>' || REC. || '</>');",null,"DECODE(C_T., 0, NULL, C_T.) AS ,"]
["HTP.P('<>' || REC. || '</>');",null,"DECODE(C_T., 0, NULL, C_T.) AS ,"]
["HTP.P('<>' || REC. || '</>');",null,"DECODE(C_T., 0, NULL, C_T.) AS ,"]
["HTP.P('<>' || REC. || '</>');",null,"DECODE(C_T., 0, NULL, C_T.) AS ,"]
["HTP.P('<>' || REC. || '</>');",null,"DECODE(C_T., 0, NULL, C_T.) AS ,"]
["HTP.P('<>' || REC. || '</>');",null,"DECODE(C_T., 0, NULL, C_T.) AS ,"]
["HTP.P('<>' || REC. || '</>');",null,"DECODE(C_T., 0, NULL, C_T.) AS ,"]
["HTP.P('<>' || REC. || '</>');",null,"DECODE(C_T., 0, NULL, C_T.) AS ,"]
["HTP.P('<>' || REC. || '</>');",null,"DECODE(C_T., 0, NULL, C_T.) AS ,"]
["HTP.P('<>' || REC. || '</>');",null,"DECODE(C_T., 0, NULL, C_T.) AS ,"]
["HTP.P('<>' || REC. || '</>');",null,"DECODE(C_T., 0, NULL, C_T.) AS ,"]
["HTP.P('<>' || REC. || '</>');",null,"DECODE(C_T., 0, NULL, C_T.) AS ,"]
["HTP.P('<>' || REC. || '</>');",null,"DECODE(C_T., 0, NULL, C_T.) AS ,"]
["HTP.P('<>' || REC. || '</>');",null,"DECODE(C_T., 0, NULL, C_T.) AS ,"]
["HTP.P('<>' || REC. || '</>');",null,"DECODE(C_T., 0, NULL, C_T.) AS ,"]
["HTP.P('<>' || REC. || '</>');",null,"DECODE(C_T., 0, NULL, C_T.) AS ,"]
["HTP.P('<>' || REC. || '</>');",null,"DECODE(C_T., 0, NULL, C_T.) AS ,"]
[{"$f":"\"HTP.P('<\" & I690 & \">' || \" & IF(MID(I690,1,6)=\"L_STUB\",\"NULL\",\"REC.\" & I690) & \" || '</\" & I690 & \">');\"","v":"HTP.P('<>' || REC. || '</>');"},null,{"$f":"\"DECODE(C_T.\" & I690 & \", 0, NULL, C_T.\" & I690 & \") AS \" & I690 & \",\"","v":"DECODE(C_T., 0, NULL, C_T.) AS ,"}]
[{"$f":"\"HTP.P('<\" & I691 & \">' || \" & IF(MID(I691,1,6)=\"L_STUB\",\"NULL\",\"REC.\" & I691) & \" || '</\" & I691 & \">');\"","v":"HTP.P('<>' || REC. || '</>');"},null,{"$f":"\"DECODE(C_T.\" & I691 & \", 0, NULL, C_T.\" & I691 & \") AS \" & I691 & \",\"","v":"DECODE(C_T., 0, NULL, C_T.) AS ,"}]
[{"$f":"\"HTP.P('<\" & I692 & \">' || \" & IF(MID(I692,1,6)=\"L_STUB\",\"NULL\",\"REC.\" & I692) & \" || '</\" & I692 & \">');\"","v":"HTP.P('<>' || REC. || '</>');"},null,{"$f":"\"DECODE(C_T.\" & I692 & \", 0, NULL, C_T.\" & I692 & \") AS \" & I692 & \",\"","v":"DECODE(C_T., 0, NULL, C_T.) AS ,"}]
[{"$f":"\"HTP.P('<\" & I693 & \">' || \" & IF(MID(I693,1,6)=\"L_STUB\",\"NULL\",\"REC.\" & I693) & \" || '</\" & I693 & \">');\"","v":"HTP.P('<>' || REC. || '</>');"},null,{"$f":"\"DECODE(C_T.\" & I693 & \", 0, NULL, C_T.\" & I693 & \") AS \" & I693 & \",\"","v":"DECODE(C_T., 0, NULL, C_T.) AS ,"}]
[{"$f":"\"HTP.P('<\" & I694 & \">' || \" & IF(MID(I694,1,6)=\"L_STUB\",\"NULL\",\"REC.\" & I694) & \" || '</\" & I694 & \">');\"","v":"HTP.P('<>' || REC. || '</>');"},null,{"$f":"\"DECODE(C_T.\" & I694 & \", 0, NULL, C_T.\" & I694 & \") AS \" & I694 & \",\"","v":"DECODE(C_T., 0, NULL, C_T.) AS ,"}]
[]
[]
[]
[]
[]
[]
[{"$f":"\"HTP.P('<\" & I701 & \">' || \" & IF(MID(I701,1,6)=\"L_STUB\",\"NULL\",\"REC.\" & I701) & \" || '</\" & I701 & \">');\"","v":"HTP.P('<>' || REC. || '</>');"},null,{"$f":"\"DECODE(C_T.\" & I701 & \", 0, NULL, C_T.\" & I701 & \") AS \" & I701 & \",\"","v":"DECODE(C_T., 0, NULL, C_T.) AS ,"}]
[{"$f":"\"HTP.P('<\" & I702 & \">' || \" & IF(MID(I702,1,6)=\"L_STUB\",\"NULL\",\"REC.\" & I702) & \" || '</\" & I702 & \">');\"","v":"HTP.P('<>' || REC. || '</>');"},null,{"$f":"\"DECODE(C_T.\" & I702 & \", 0, NULL, C_T.\" & I702 & \") AS \" & I702 & \",\"","v":"DECODE(C_T., 0, NULL, C_T.) AS ,"}]
["HTP.P('<>' || REC. || '</>');",null,"DECODE(C_T., 0, NULL, C_T.) AS ,"]
["HTP.P('<>' || REC. || '</>');",null,"DECODE(C_T., 0, NULL, C_T.) AS ,"]
["HTP.P('<>' || REC. || '</>');",null,"DECODE(C_T., 0, NULL, C_T.) AS ,"]
["HTP.P('<>' || REC. || '</>');",null,"DECODE(C_T., 0, NULL, C_T.) AS ,"]
["HTP.P('<>' || REC. || '</>');",null,"DECODE(C_T., 0, NULL, C_T.) AS ,"]
["HTP.P('<>' || REC. || '</>');",null,"DECODE(C_T., 0, NULL, C_T.) AS ,"]
["HTP.P('<>' || REC. || '</>');",null,"DECODE(C_T., 0, NULL, C_T.) AS ,"]
["HTP.P('<>' || REC. || '</>');",null,"DECODE(C_T., 0, NULL, C_T.) AS ,"]
["HTP.P('<>' || REC. || '</>');",null,"DECODE(C_T., 0, NULL, C_T.) AS ,"]
["HTP.P('<>' || REC. || '</>');",null,"DECODE(C_T., 0, NULL, C_T.) AS ,"]
["HTP.P('<>' || REC. || '</>');",null,"DECODE(C_T., 0, NULL, C_T.) AS ,"]
["HTP.P('<>' || REC. || '</>');",null,"DECODE(C_T., 0, NULL, C_T.) AS ,"]
["HTP.P('<>' || REC. || '</>');",null,"DECODE(C_T., 0, NULL, C_T.) AS ,"]
["HTP.P('<>' || REC. || '</>');",null,"DECODE(C_T., 0, NULL, C_T.) AS ,"]
["HTP.P('<>' || REC. || '</>');",null,"DECODE(C_T., 0, NULL, C_T.) AS ,"]
["HTP.P('<>' || REC. || '</>');",null,"DECODE(C_T., 0, NULL, C_T.) AS ,"]
["HTP.P('<>' || REC. || '</>');",null,"DECODE(C_T., 0, NULL, C_T.) AS ,"]
["HTP.P('<>' || REC. || '</>');",null,"DECODE(C_T., 0, NULL, C_T.) AS ,"]
["HTP.P('<>' || REC. || '</>');",null,"DECODE(C_T., 0, NULL, C_T.) AS ,"]
["HTP.P('<>' || REC. || '</>');",null,"DECODE(C_T., 0, NULL, C_T.) AS ,"]
["HTP.P('<>' || REC. || '</>');",null,"DECODE(C_T., 0, NULL, C_T.) AS ,"]
["HTP.P('<>' || REC. || '</>');",null,"DECODE(C_T., 0, NULL, C_T.) AS ,"]
["HTP.P('<>' || REC. || '</>');",null,"DECODE(C_T., 0, NULL, C_T.) AS ,"]
["HTP.P('<>' || REC. || '</>');",null,"DECODE(C_T., 0, NULL, C_T.) AS ,"]
["HTP.P('<>' || REC. || '</>');",null,"DECODE(C_T., 0, NULL, C_T.) AS ,"]
["HTP.P('<>' || REC. || '</>');",null,"DECODE(C_T., 0, NULL, C_T.) AS ,"]
["HTP.P('<>' || REC. || '</>');",null,"DECODE(C_T., 0, NULL, C_T.) AS ,"]
["HTP.P('<>' || REC. || '</>');",null,"DECODE(C_T., 0, NULL, C_T.) AS ,"]
["HTP.P('<>' || REC. || '</>');",null,"DECODE(C_T., 0, NULL, C_T.) AS ,"]
["HTP.P('<>' || REC. || '</>');",null,"DECODE(C_T., 0, NULL, C_T.) AS ,"]
["HTP.P('<>' || REC. || '</>');",null,"DECODE(C_T., 0, NULL, C_T.) AS ,"]
["HTP.P('<>' || REC. || '</>');",null,"DECODE(C_T., 0, NULL, C_T.) AS ,"]
["HTP.P('<>' || REC. || '</>');",null,"DECODE(C_T., 0, NULL, C_T.) AS ,"]
["HTP.P('<>' || REC. || '</>');",null,"DECODE(C_T., 0, NULL, C_T.) AS ,"]
[]
[]
[]
[]
[]
[]
[{"$f":"\"HTP.P('<\" & I743 & \">' || \" & IF(MID(I743,1,6)=\"L_STUB\",\"NULL\",\"REC.\" & I743) & \" || '</\" & I743 & \">');\"","v":"HTP.P('<>' || REC. || '</>');"},null,{"$f":"\"DECODE(C_T.\" & I743 & \", 0, NULL, C_T.\" & I743 & \") AS \" & I743 & \",\"","v":"DECODE(C_T., 0, NULL, C_T.) AS ,"}]
[{"$f":"\"HTP.P('<\" & I744 & \">' || \" & IF(MID(I744,1,6)=\"L_STUB\",\"NULL\",\"REC.\" & I744) & \" || '</\" & I744 & \">');\"","v":"HTP.P('<>' || REC. || '</>');"},null,{"$f":"\"DECODE(C_T.\" & I744 & \", 0, NULL, C_T.\" & I744 & \") AS \" & I744 & \",\"","v":"DECODE(C_T., 0, NULL, C_T.) AS ,"}]
["HTP.P('<>' || REC. || '</>');",null,"DECODE(C_T., 0, NULL, C_T.) AS ,"]
["HTP.P('<>' || REC. || '</>');",null,"DECODE(C_T., 0, NULL, C_T.) AS ,"]
["HTP.P('<>' || REC. || '</>');",null,"DECODE(C_T., 0, NULL, C_T.) AS ,"]
["HTP.P('<>' || REC. || '</>');",null,"DECODE(C_T., 0, NULL, C_T.) AS ,"]
["HTP.P('<>' || REC. || '</>');",null,"DECODE(C_T., 0, NULL, C_T.) AS ,"]
["HTP.P('<>' || REC. || '</>');",null,"DECODE(C_T., 0, NULL, C_T.) AS ,"]
["HTP.P('<>' || REC. || '</>');",null,"DECODE(C_T., 0, NULL, C_T.) AS ,"]
["HTP.P('<>' || REC. || '</>');",null,"DECODE(C_T., 0, NULL, C_T.) AS ,"]
["HTP.P('<>' || REC. || '</>');",null,"DECODE(C_T., 0, NULL, C_T.) AS ,"]
["HTP.P('<>' || REC. || '</>');",null,"DECODE(C_T., 0, NULL, C_T.) AS ,"]
["HTP.P('<>' || REC. || '</>');",null,"DECODE(C_T., 0, NULL, C_T.) AS ,"]
["HTP.P('<>' || REC. || '</>');",null,"DECODE(C_T., 0, NULL, C_T.) AS ,"]
["HTP.P('<>' || REC. || '</>');",null,"DECODE(C_T., 0, NULL, C_T.) AS ,"]
["HTP.P('<>' || REC. || '</>');",null,"DECODE(C_T., 0, NULL, C_T.) AS ,"]
["HTP.P('<>' || REC. || '</>');",null,"DECODE(C_T., 0, NULL, C_T.) AS ,"]
["HTP.P('<>' || REC. || '</>');",null,"DECODE(C_T., 0, NULL, C_T.) AS ,"]
["HTP.P('<>' || REC. || '</>');",null,"DECODE(C_T., 0, NULL, C_T.) AS ,"]
["HTP.P('<>' || REC. || '</>');",null,"DECODE(C_T., 0, NULL, C_T.) AS ,"]
["HTP.P('<>' || REC. || '</>');",null,"DECODE(C_T., 0, NULL, C_T.) AS ,"]
["HTP.P('<>' || REC. || '</>');",null,"DECODE(C_T., 0, NULL, C_T.) AS ,"]
["HTP.P('<>' || REC. || '</>');",null,"DECODE(C_T., 0, NULL, C_T.) AS ,"]
["HTP.P('<>' || REC. || '</>');",null,"DECODE(C_T., 0, NULL, C_T.) AS ,"]
["HTP.P('<>' || REC. || '</>');",null,"DECODE(C_T., 0, NULL, C_T.) AS ,"]
["HTP.P('<>' || REC. || '</>');",null,"DECODE(C_T., 0, NULL, C_T.) AS ,"]
["HTP.P('<>' || REC. || '</>');",null,"DECODE(C_T., 0, NULL, C_T.) AS ,"]
["HTP.P('<>' || REC. || '</>');",null,"DECODE(C_T., 0, NULL, C_T.) AS ,"]
["HTP.P('<>' || REC. || '</>');",null,"DECODE(C_T., 0, NULL, C_T.) AS ,"]
["HTP.P('<>' || REC. || '</>');",null,"DECODE(C_T., 0, NULL, C_T.) AS ,"]
["HTP.P('<>' || REC. || '</>');",null,"DECODE(C_T., 0, NULL, C_T.) AS ,"]
["HTP.P('<>' || REC. || '</>');",null,"DECODE(C_T., 0, NULL, C_T.) AS ,"]
["HTP.P('<>' || REC. || '</>');",null,"DECODE(C_T., 0, NULL, C_T.) AS ,"]
["HTP.P('<>' || REC. || '</>');",null,"DECODE(C_T., 0, NULL, C_T.) AS ,"]
["HTP.P('<>' || REC. || '</>');",null,"DECODE(C_T., 0, NULL, C_T.) AS ,"]
["HTP.P('<>' || REC. || '</>');",null,"DECODE(C_T., 0, NULL, C_T.) AS ,"]
[]
[]
[]
[]
[]
[]
[{"$f":"\"HTP.P('<\" & I785 & \">' || \" & IF(MID(I785,1,6)=\"L_STUB\",\"NULL\",\"REC.\" & I785) & \" || '</\" & I785 & \">');\"","v":"HTP.P('<>' || REC. || '</>');"},null,{"$f":"\"DECODE(C_T.\" & I785 & \", 0, NULL, C_T.\" & I785 & \") AS \" & I785 & \",\"","v":"DECODE(C_T., 0, NULL, C_T.) AS ,"}]
[{"$f":"\"HTP.P('<\" & I786 & \">' || \" & IF(MID(I786,1,6)=\"L_STUB\",\"NULL\",\"REC.\" & I786) & \" || '</\" & I786 & \">');\"","v":"HTP.P('<>' || REC. || '</>');"},null,{"$f":"\"DECODE(C_T.\" & I786 & \", 0, NULL, C_T.\" & I786 & \") AS \" & I786 & \",\"","v":"DECODE(C_T., 0, NULL, C_T.) AS ,"}]
["HTP.P('<>' || REC. || '</>');",null,"DECODE(C_T., 0, NULL, C_T.) AS ,"]
["HTP.P('<>' || REC. || '</>');",null,"DECODE(C_T., 0, NULL, C_T.) AS ,"]
["HTP.P('<>' || REC. || '</>');",null,"DECODE(C_T., 0, NULL, C_T.) AS ,"]
["HTP.P('<>' || REC. || '</>');",null,"DECODE(C_T., 0, NULL, C_T.) AS ,"]
["HTP.P('<>' || REC. || '</>');",null,"DECODE(C_T., 0, NULL, C_T.) AS ,"]
["HTP.P('<>' || REC. || '</>');",null,"DECODE(C_T., 0, NULL, C_T.) AS ,"]
["HTP.P('<>' || REC. || '</>');",null,"DECODE(C_T., 0, NULL, C_T.) AS ,"]
["HTP.P('<>' || REC. || '</>');",null,"DECODE(C_T., 0, NULL, C_T.) AS ,"]
["HTP.P('<>' || REC. || '</>');",null,"DECODE(C_T., 0, NULL, C_T.) AS ,"]
["HTP.P('<>' || REC. || '</>');",null,"DECODE(C_T., 0, NULL, C_T.) AS ,"]
["HTP.P('<>' || REC. || '</>');",null,"DECODE(C_T., 0, NULL, C_T.) AS ,"]
["HTP.P('<>' || REC. || '</>');",null,"DECODE(C_T., 0, NULL, C_T.) AS ,"]
["HTP.P('<>' || REC. || '</>');",null,"DECODE(C_T., 0, NULL, C_T.) AS ,"]
["HTP.P('<>' || REC. || '</>');",null,"DECODE(C_T., 0, NULL, C_T.) AS ,"]
["HTP.P('<>' || REC. || '</>');",null,"DECODE(C_T., 0, NULL, C_T.) AS ,"]
["HTP.P('<>' || REC. || '</>');",null,"DECODE(C_T., 0, NULL, C_T.) AS ,"]
["HTP.P('<>' || REC. || '</>');",null,"DECODE(C_T., 0, NULL, C_T.) AS ,"]
["HTP.P('<>' || REC. || '</>');",null,"DECODE(C_T., 0, NULL, C_T.) AS ,"]
["HTP.P('<>' || REC. || '</>');",null,"DECODE(C_T., 0, NULL, C_T.) AS ,"]
["HTP.P('<>' || REC. || '</>');",null,"DECODE(C_T., 0, NULL, C_T.) AS ,"]
["HTP.P('<>' || REC. || '</>');",null,"DECODE(C_T., 0, NULL, C_T.) AS ,"]
["HTP.P('<>' || REC. || '</>');",null,"DECODE(C_T., 0, NULL, C_T.) AS ,"]
["HTP.P('<>' || REC. || '</>');",null,"DECODE(C_T., 0, NULL, C_T.) AS ,"]
["HTP.P('<>' || REC. || '</>');",null,"DECODE(C_T., 0, NULL, C_T.) AS ,"]
["HTP.P('<>' || REC. || '</>');",null,"DECODE(C_T., 0, NULL, C_T.) AS ,"]
["HTP.P('<>' || REC. || '</>');",null,"DECODE(C_T., 0, NULL, C_T.) AS ,"]
["HTP.P('<>' || REC. || '</>');",null,"DECODE(C_T., 0, NULL, C_T.) AS ,"]
["HTP.P('<>' || REC. || '</>');",null,"DECODE(C_T., 0, NULL, C_T.) AS ,"]
["HTP.P('<>' || REC. || '</>');",null,"DECODE(C_T., 0, NULL, C_T.) AS ,"]
["HTP.P('<>' || REC. || '</>');",null,"DECODE(C_T., 0, NULL, C_T.) AS ,"]
["HTP.P('<>' || REC. || '</>');",null,"DECODE(C_T., 0, NULL, C_T.) AS ,"]
["HTP.P('<>' || REC. || '</>');",null,"DECODE(C_T., 0, NULL, C_T.) AS ,"]
["HTP.P('<>' || REC. || '</>');",null,"DECODE(C_T., 0, NULL, C_T.) AS ,"]
["HTP.P('<>' || REC. || '</>');",null,"DECODE(C_T., 0, NULL, C_T.) AS ,"]
[]
[]
[]
[]
[]
[]
[{"$f":"\"HTP.P('<\" & I827 & \">' || \" & IF(MID(I827,1,6)=\"L_STUB\",\"NULL\",\"REC.\" & I827) & \" || '</\" & I827 & \">');\"","v":"HTP.P('<>' || REC. || '</>');"},null,{"$f":"\"DECODE(C_T.\" & I827 & \", 0, NULL, C_T.\" & I827 & \") AS \" & I827 & \",\"","v":"DECODE(C_T., 0, NULL, C_T.) AS ,"}]
[{"$f":"\"HTP.P('<\" & I828 & \">' || \" & IF(MID(I828,1,6)=\"L_STUB\",\"NULL\",\"REC.\" & I828) & \" || '</\" & I828 & \">');\"","v":"HTP.P('<>' || REC. || '</>');"},null,{"$f":"\"DECODE(C_T.\" & I828 & \", 0, NULL, C_T.\" & I828 & \") AS \" & I828 & \",\"","v":"DECODE(C_T., 0, NULL, C_T.) AS ,"}]
["HTP.P('<>' || REC. || '</>');",null,"DECODE(C_T., 0, NULL, C_T.) AS ,"]
["HTP.P('<>' || REC. || '</>');",null,"DECODE(C_T., 0, NULL, C_T.) AS ,"]
["HTP.P('<>' || REC. || '</>');",null,"DECODE(C_T., 0, NULL, C_T.) AS ,"]
["HTP.P('<>' || REC. || '</>');",null,"DECODE(C_T., 0, NULL, C_T.) AS ,"]
["HTP.P('<>' || REC. || '</>');",null,"DECODE(C_T., 0, NULL, C_T.) AS ,"]
["HTP.P('<>' || REC. || '</>');",null,"DECODE(C_T., 0, NULL, C_T.) AS ,"]
["HTP.P('<>' || REC. || '</>');",null,"DECODE(C_T., 0, NULL, C_T.) AS ,"]
["HTP.P('<>' || REC. || '</>');",null,"DECODE(C_T., 0, NULL, C_T.) AS ,"]
["HTP.P('<>' || REC. || '</>');",null,"DECODE(C_T., 0, NULL, C_T.) AS ,"]
["HTP.P('<>' || REC. || '</>');",null,"DECODE(C_T., 0, NULL, C_T.) AS ,"]
["HTP.P('<>' || REC. || '</>');",null,"DECODE(C_T., 0, NULL, C_T.) AS ,"]
["HTP.P('<>' || REC. || '</>');",null,"DECODE(C_T., 0, NULL, C_T.) AS ,"]
["HTP.P('<>' || REC. || '</>');",null,"DECODE(C_T., 0, NULL, C_T.) AS ,"]
["HTP.P('<>' || REC. || '</>');",null,"DECODE(C_T., 0, NULL, C_T.) AS ,"]
["HTP.P('<>' || REC. || '</>');",null,"DECODE(C_T., 0, NULL, C_T.) AS ,"]
["HTP.P('<>' || REC. || '</>');",null,"DECODE(C_T., 0, NULL, C_T.) AS ,"]
["HTP.P('<>' || REC. || '</>');",null,"DECODE(C_T., 0, NULL, C_T.) AS ,"]
["HTP.P('<>' || REC. || '</>');",null,"DECODE(C_T., 0, NULL, C_T.) AS ,"]
["HTP.P('<>' || REC. || '</>');",null,"DECODE(C_T., 0, NULL, C_T.) AS ,"]
["HTP.P('<>' || REC. || '</>');",null,"DECODE(C_T., 0, NULL, C_T.) AS ,"]
["HTP.P('<>' || REC. || '</>');",null,"DECODE(C_T., 0, NULL, C_T.) AS ,"]
["HTP.P('<>' || REC. || '</>');",null,"DECODE(C_T., 0, NULL, C_T.) AS ,"]
["HTP.P('<>' || REC. || '</>');",null,"DECODE(C_T., 0, NULL, C_T.) AS ,"]
["HTP.P('<>' || REC. || '</>');",null,"DECODE(C_T., 0, NULL, C_T.) AS ,"]

{"sheet":"TECH_HORISONTAL","index":12,"n_rows":52,"n_cols":123,"rows_kept":52,"hidden":true,"merged":[[3,68,3,74],[3,122,3,128],[4,68,4,74],[4,122,4,128],[5,68,5,74],[5,122,5,128],[6,0,6,1],[8,24,8,32],[9,24,9,32],[10,24,10,32],[11,24,11,32],[12,24,12,32],[13,24,13,32],[14,24,14,32],[19,0,19,1],[21,24,21,32],[22,24,22,32],[23,24,23,32],[24,24,24,32],[25,24,25,32],[32,0,32,1],[34,24,34,32],[35,24,35,32],[36,24,36,32],[37,24,37,32],[38,24,38,32],[45,0,45,1],[47,24,47,32],[48,24,48,32],[49,24,49,32],[50,24,50,32],[51,24,51,32]]}
[]
[]
[]
[{"$nulls":62},"по отдельным мероприятиям",{"$nulls":5},"HEAT_FACT_EVENT_EXISTS_RANGE",{"$nulls":47},"по отдельным мероприятиям",{"$nulls":5},"HEAT_PLAN_EVENT_EXISTS_RANGE"]
[{"$nulls":62},"без деления на мероприятия",{"$nulls":5},"HEAT_FACT_EVENT_NOT_EXISTS_RANGE",{"$nulls":47},"без деления на мероприятия",{"$nulls":5},"HEAT_PLAN_EVENT_NOT_EXISTS_RANGE"]
[{"$nulls":68},"HEAT_FACT_EMPTY_RANGE",{"$nulls":53},"HEAT_PLAN_EMPTY_RANGE"]
["ADD_HEAT_ORG_RANGE",{"$nulls":23},"SPHERE SPECIFIC",{"$nulls":6},"SPHERE SPECIFIC","SPHERE SPECIFIC"]
[{"$nulls":4},"О",{"$nulls":4},{"$f":"IF(LEN(I8)=0,\"\",VLOOKUP(I8,OKTMO_VS_TYPE_LIST,2,FALSE))","v":""},null,null,"Изменить",{"$nulls":22},"нет",{"$nulls":53},"нет"]
[{"$nulls":24},"HEAT_[FACT/PLAN]_EXISTS_RANGE",{"$nulls":10},"да",{"$nulls":11},{"$f":"AW9+AX9","v":0},{"$nulls":3},{"$f":"BA9+BD9","v":0},{"$f":"BB9+BC9","v":0},{"$nulls":36},"да",{"$nulls":9},{"$f":"CW9+CX9","v":0}]
[{"$nulls":24},"HEAT_[FACT/PLAN]_NOT_EXISTS_RANGE",{"$nulls":10},"нет",{"$nulls":53},"нет"]
[{"$nulls":24},"HEAT_[FACT/PLAN]_PAYMENT_1_RANGE"]
[{"$nulls":24},"HEAT_[FACT/PLAN]_PAYMENT_2_RANGE"]
[{"$nulls":24},"HEAT_[FACT/PLAN]_PAYMENT_3_RANGE"]
[{"$nulls":24},"HEAT_[FACT/PLAN]_PAYMENT_4_RANGE"]
[{"$nulls":24},"HEAT_[FACT/PLAN]_PAYMENT_0_RANGE"]
[]
[]
[]
[]
["ADD_HVSNA_ORG_RANGE",{"$nulls":23},"SPHERE SPECIFIC",{"$nulls":7},"SPHERE SPECIFIC"]
[{"$nulls":4},"О",{"$nulls":4},{"$f":"IF(LEN(I21)=0,\"\",VLOOKUP(I21,OKTMO_VS_TYPE_LIST,2,FALSE))","v":""},null,null,"Изменить",{"$nulls":22},"нет",{"$nulls":53},"нет"]
[{"$nulls":24},"HVSNA_[FACT/PLAN]_EXISTS_RANGE",{"$nulls":10},"да",{"$nulls":14},{"$f":"AZ22+BA22","v":0},{"$nulls":3},{"$f":"BD22+BE22","v":0},{"$nulls":34},"да"]
[{"$nulls":24},"HVSNA_[FACT/PLAN]_NOT_EXISTS_RANGE",{"$nulls":10},"нет",{"$nulls":53},"нет"]
[{"$nulls":24},"HVSNA_[FACT/PLAN]_PAYMENT_1_RANGE"]
[{"$nulls":24},"HVSNA_[FACT/PLAN]_PAYMENT_2_RANGE"]
[{"$nulls":24},"HVSNA_[FACT/PLAN]_PAYMENT_0_RANGE"]
[]
[]
[]
[]
[]
[]
["ADD_CVSNA_ORG_RANGE",{"$nulls":23},"SPHERE SPECIFIC",{"$nulls":7},"SPHERE SPECIFIC"]
[{"$nulls":4},"О",{"$nulls":4},{"$f":"IF(LEN(I34)=0,\"\",VLOOKUP(I34,OKTMO_VS_TYPE_LIST,2,FALSE))","v":""},null,null,"Изменить",{"$nulls":22},"нет",{"$nulls":53},"нет"]
[{"$nulls":24},"CVSNA_[FACT/PLAN]_EXISTS_RANGE",{"$nulls":10},"да",{"$nulls":14},{"$f":"AZ35+BA35","v":0},{"$nulls":3},{"$f":"BD35+BE35","v":0},{"$nulls":34},"да"]
[{"$nulls":24},"CVSNA_[FACT/PLAN]_NOT_EXISTS_RANGE",{"$nulls":10},"нет",{"$nulls":53},"нет"]
[{"$nulls":24},"CVSNA_[FACT/PLAN]_PAYMENT_1_RANGE"]
[{"$nulls":24},"CVSNA_[FACT/PLAN]_PAYMENT_2_RANGE"]
[{"$nulls":24},"CVSNA_[FACT/PLAN]_PAYMENT_0_RANGE"]
[]
[]
[]
[]
[]
[]
["ADD_VOTV_ORG_RANGE",{"$nulls":23},"SPHERE SPECIFIC",{"$nulls":7},"SPHERE SPECIFIC"]
[{"$nulls":4},"О",{"$nulls":4},{"$f":"IF(LEN(I47)=0,\"\",VLOOKUP(I47,OKTMO_VS_TYPE_LIST,2,FALSE))","v":""},null,null,"Изменить",{"$nulls":22},"нет",{"$nulls":53},"нет"]
[{"$nulls":24},"VOTV_[FACT/PLAN]_EXISTS_RANGE",{"$nulls":10},"да",{"$nulls":14},{"$f":"AZ48+BA48","v":0},{"$nulls":3},{"$f":"BD48+BE48","v":0},{"$nulls":34},"да"]
[{"$nulls":24},"VOTV_[FACT/PLAN]_NOT_EXISTS_RANGE",{"$nulls":10},"нет",{"$nulls":53},"нет"]
[{"$nulls":24},"VOTV_[FACT/PLAN]_PAYMENT_1_RANGE"]
[{"$nulls":24},"VOTV_[FACT/PLAN]_PAYMENT_2_RANGE"]
[{"$nulls":24},"VOTV_[FACT/PLAN]_PAYMENT_0_RANGE"]

{"sheet":"modfrmActivity","index":13,"n_rows":0,"n_cols":0,"rows_kept":0,"hidden":true}

{"sheet":"REESTR_ORG","index":14,"n_rows":524,"n_cols":137,"rows_kept":524,"hidden":true}
["№","НСРФ","МР","ОКТМР","МО","ОКТМО","RST_ORG_ID","Наименование","ИНН","КПП","ВД (OLD)","ВД (COMBO)","ВД (PATH)","ORG_START_DATE","ORG_END_DATE","VDET_START_DATE","VDET_END_DATE",{"$nulls":3},"№","НСРФ","МР","ОКТМР","МО","ОКТМО","RST_ORG_ID","Наименование","ИНН","КПП","ВД (OLD)","ВД (COMBO)","ВД (PATH)","ORG_START_DATE","ORG_END_DATE","VDET_START_DATE","VDET_END_DATE",{"$nulls":3},"№","НСРФ","МР","ОКТМР","МО","ОКТМО","RST_ORG_ID","Наименование","ИНН","КПП","ВД (OLD)","ВД (COMBO)","ВД (PATH)","ORG_START_DATE","ORG_END_DATE","VDET_START_DATE","VDET_END_DATE",{"$nulls":3},"№","НСРФ","МР","ОКТМР","МО","ОКТМО","RST_ORG_ID","Наименование","ИНН","КПП","ВД (OLD)","ВД (COMBO)","ВД (PATH)","ORG_START_DATE","ORG_END_DATE","VDET_START_DATE","VDET_END_DATE",{"$nulls":3},"№","НСРФ","МР","ОКТМР","МО","ОКТМО","RST_ORG_ID","Наименование","ИНН","КПП","ВД (OLD)","ВД (COMBO)","ВД (PATH)","ORG_START_DATE","ORG_END_DATE","VDET_START_DATE","VDET_END_DATE",{"$nulls":3},"№","НСРФ","МР","ОКТМР","МО","ОКТМО","RST_ORG_ID","Наименование","ИНН","КПП","ВД (OLD)","ВД (COMBO)","ВД (PATH)","ORG_START_DATE","ORG_END_DATE","VDET_START_DATE","VDET_END_DATE",{"$nulls":3},"№","НСРФ","МР","ОКТМР","МО","ОКТМО","RST_ORG_ID","Наименование","ИНН","КПП","ВД (OLD)","ВД (COMBO)","ВД (PATH)","ORG_START_DATE","ORG_END_DATE","VDET_START_DATE","VDET_END_DATE"]
[1,"Республика Башкортостан","Абзелиловский муниципальный район","80601000","Альмухаметовский сельский совет","80601404","26353611","ООО ЖКХ \"Урал\" Абзелиловского района РБ","0201010513","020101001","Оказание услуг в сфере водоснабжения","Подвоз воды :: Техническая :: Питьевая :: Техническая :: Питьевая :: Техническая :: Питьевая :: Очистка","/ХВС/Подвоз воды :: /ХВС/Сбыт/Техническая :: /ХВС/Сбыт/Питьевая :: /ХВС/Транспортировка/Техническая :: /ХВС/Транспортировка/Питьевая :: /ХВС/Производство/Техническая :: /ХВС/Производство/Питьевая :: /ХВС/Очистка",null,null,"15-09-2008 00:00:00"]
[2,"Республика Башкортостан","Абзелиловский муниципальный район","80601000","Аскаровский сельский совет","80601410","30345497","МУП \"Аскар\"","0201012292","020101001","Транспортировка воды","Питьевая :: Питьевая :: Питьевая","/ХВС/Сбыт/Питьевая :: /ХВС/Транспортировка/Питьевая :: /ХВС/Производство/Питьевая","02-10-2015 00:00:00",null,"29-12-2015 00:00:00"]
[3,"Республика Башкортостан","Абзелиловский муниципальный район","80601000","Аскаровский сельский совет","80601410","30345497","МУП \"Аскар\"","0201012292","020101001","Оказание услуг в сфере водоснабжения","Питьевая :: Питьевая :: Питьевая","/ХВС/Сбыт/Питьевая :: /ХВС/Транспортировка/Питьевая :: /ХВС/Производство/Питьевая","02-10-2015 00:00:00",null,"29-12-2015 00:00:00"]
[4,"Республика Башкортостан","Абзелиловский муниципальный район","80601000","Давлетовский сельский совет","80601422","26353612","ООО \"Давлетовское ЖКХ\" МР Абзелиловский район","0201010520","020101001","Оказание услуг в сфере водоснабжения","Подвоз воды :: Техническая :: Питьевая :: Техническая :: Питьевая :: Техническая :: Питьевая :: Очистка","/ХВС/Подвоз воды :: /ХВС/Сбыт/Техническая :: /ХВС/Сбыт/Питьевая :: /ХВС/Транспортировка/Техническая :: /ХВС/Транспортировка/Питьевая :: /ХВС/Производство/Техническая :: /ХВС/Производство/Питьевая :: /ХВС/Очистка",null,null,"31-03-2016 00:00:00","31-12-2017 00:00:00"]
[5,"Республика Башкортостан","Абзелиловский муниципальный район","80601000","Краснобашкирский сельский совет","80601428","28942841","ИП Савинская В.В.","744400637332","отсутствует","Оказание услуг в сфере водоснабжения","Подвоз воды :: Техническая :: Питьевая :: Техническая :: Питьевая :: Техническая :: Питьевая :: Очистка","/ХВС/Подвоз воды :: /ХВС/Сбыт/Техническая :: /ХВС/Сбыт/Питьевая :: /ХВС/Транспортировка/Техническая :: /ХВС/Транспортировка/Питьевая :: /ХВС/Производство/Техническая :: /ХВС/Производство/Питьевая :: /ХВС/Очистка","20-03-2015 00:00:00",null,"15-01-2016 00:00:00","31-12-2017 00:00:00"]
[6,"Республика Башкортостан","Абзелиловский муниципальный район","80601000","Краснобашкирский сельский совет","80601428","30345497","МУП \"Аскар\"","0201012292","020101001","Оказание услуг в сфере водоснабжения","Питьевая :: Питьевая :: Питьевая","/ХВС/Сбыт/Питьевая :: /ХВС/Транспортировка/Питьевая :: /ХВС/Производство/Питьевая","02-10-2015 00:00:00",null,"12-04-2017 00:00:00"]
[7,"Республика Башкортостан","Абзелиловский муниципальный район","80601000","Краснобашкирский сельский совет","80601428","30345497","МУП \"Аскар\"","0201012292","020101001","Транспортировка воды","Питьевая :: Питьевая :: Питьевая","/ХВС/Сбыт/Питьевая :: /ХВС/Транспортировка/Питьевая :: /ХВС/Производство/Питьевая","02-10-2015 00:00:00",null,"12-04-2017 00:00:00"]
[8,"Республика Башкортостан","Абзелиловский муниципальный район","80601000","Краснобашкирский сельский совет","80601428","31081967","МУП \"ЖКХ Башкирия\"","0201013930","020101001","Оказание услуг в сфере водоснабжения","Питьевая :: Техническая :: Питьевая :: Очистка","/ХВС/Сбыт/Питьевая :: /ХВС/Транспортировка/Техническая :: /ХВС/Производство/Питьевая :: /ХВС/Очистка","27-04-2018 00:00:00",null,"27-04-2018 00:00:00"]
[9,"Республика Башкортостан","Абзелиловский муниципальный район","80601000","Краснобашкирский сельский совет","80601428","31081967","МУП \"ЖКХ Башкирия\"","0201013930","020101001","Транспортировка воды","Питьевая :: Техническая :: Питьевая :: Очистка","/ХВС/Сбыт/Питьевая :: /ХВС/Транспортировка/Техническая :: /ХВС/Производство/Питьевая :: /ХВС/Очистка","27-04-2018 00:00:00",null,"27-04-2018 00:00:00"]
[10,"Республика Башкортостан","Абзелиловский муниципальный район","80601000","Ташбулатовский сельский совет","80601434","28273549","ГУП санаторий \"Якты-Куль\" РБ","0201007528","020101001","Оказание услуг в сфере водоснабжения","Подвоз воды :: Техническая :: Питьевая :: Техническая :: Питьевая :: Техническая :: Питьевая :: Очистка","/ХВС/Подвоз воды :: /ХВС/Сбыт/Техническая :: /ХВС/Сбыт/Питьевая :: /ХВС/Транспортировка/Техническая :: /ХВС/Транспортировка/Питьевая :: /ХВС/Производство/Техническая :: /ХВС/Производство/Питьевая :: /ХВС/Очистка","02-10-2013 00:00:00",null,"02-10-2013 00:00:00"]
[11,"Республика Башкортостан","Абзелиловский муниципальный район","80601000","Ташбулатовский сельский совет","80601434","26805221","МУП \"Абзелиловское специализированное предприятие коммунального обслуживания\"","0201007969","020101001","Оказание услуг в сфере водоснабжения","Питьевая :: Питьевая :: Питьевая :: Очистка","/ХВС/Сбыт/Питьевая :: /ХВС/Транспортировка/Питьевая :: /ХВС/Производство/Питьевая :: /ХВС/Очистка",null,null,"13-01-2016 00:00:00"]
[12,"Республика Башкортостан","Абзелиловский муниципальный район","80601000","Ташбулатовский сельский совет","80601434","26805221","МУП \"Абзелиловское специализированное предприятие коммунального обслуживания\"","0201007969","020101001","Транспортировка воды","Питьевая :: Питьевая :: Питьевая :: Очистка","/ХВС/Сбыт/Питьевая :: /ХВС/Транспортировка/Питьевая :: /ХВС/Производство/Питьевая :: /ХВС/Очистка",null,null,"13-01-2016 00:00:00"]
[13,"Республика Башкортостан","Абзелиловский муниципальный район","80601000","Янгильский сельский совет","80601446","26454720","ООО ЖРЭУ \"Источник\" МР Абзелиловский район РБ","0201010538","020101001","Оказание услуг в сфере водоснабжения","Подвоз воды :: Техническая :: Питьевая :: Техническая :: Питьевая :: Техническая :: Питьевая :: Очистка","/ХВС/Подвоз воды :: /ХВС/Сбыт/Техническая :: /ХВС/Сбыт/Питьевая :: /ХВС/Транспортировка/Техническая :: /ХВС/Транспортировка/Питьевая :: /ХВС/Производство/Техническая :: /ХВС/Производство/Питьевая :: /ХВС/Очистка",null,null,"11-12-2009 00:00:00"]
[14,"Республика Башкортостан","Альшеевский муниципальный район","80602000","Абдрашитовский сельский совет","80602404","26922298","Федеральное государственное бюджетное учреждение санаторий \"Шафраново\" Министерства здравоохранения Российской Федерации","0202000395","020201001","Оказание услуг в сфере водоснабжения","Подвоз воды :: Техническая :: Питьевая :: Техническая :: Питьевая :: Техническая :: Питьевая :: Очистка","/ХВС/Подвоз воды :: /ХВС/Сбыт/Техническая :: /ХВС/Сбыт/Питьевая :: /ХВС/Транспортировка/Техническая :: /ХВС/Транспортировка/Питьевая :: /ХВС/Производство/Техническая :: /ХВС/Производство/Питьевая :: /ХВС/Очистка",null,null,"03-08-2011 00:00:00"]
[15,"Республика Башкортостан","Альшеевский муниципальный район","80602000","Аксеновский сельский совет","80602406","30390648","Общество с ограниченной ответственностью \"Калипсо\"","0202009920","020245009","Оказание услуг в сфере водоснабжения","Питьевая :: Питьевая :: Очистка","/ХВС/Сбыт/Питьевая :: /ХВС/Производство/Питьевая :: /ХВС/Очистка","20-01-2016 00:00:00",null,"20-01-2016 00:00:00"]
[16,"Республика Башкортостан","Альшеевский муниципальный район","80602000","Аксеновский сельский совет","80602406","26922298","Федеральное государственное бюджетное учреждение санаторий \"Шафраново\" Министерства здравоохранения Российской Федерации","0202000395","020201001","Оказание услуг в сфере водоснабжения","Подвоз воды :: Техническая :: Питьевая :: Техническая :: Питьевая :: Техническая :: Питьевая :: Очистка","/ХВС/Подвоз воды :: /ХВС/Сбыт/Техническая :: /ХВС/Сбыт/Питьевая :: /ХВС/Транспортировка/Техническая :: /ХВС/Транспортировка/Питьевая :: /ХВС/Производство/Техническая :: /ХВС/Производство/Питьевая :: /ХВС/Очистка",null,null,"03-08-2011 00:00:00"]
[17,"Республика Башкортостан","Альшеевский муниципальный район","80602000","Воздвиженский сельский совет","80602413","26922298","Федеральное государственное бюджетное учреждение санаторий \"Шафраново\" Министерства здравоохранения Российской Федерации","0202000395","020201001","Оказание услуг в сфере водоснабжения","Подвоз воды :: Техническая :: Питьевая :: Техническая :: Питьевая :: Техническая :: Питьевая :: Очистка","/ХВС/Подвоз воды :: /ХВС/Сбыт/Техническая :: /ХВС/Сбыт/Питьевая :: /ХВС/Транспортировка/Техническая :: /ХВС/Транспортировка/Питьевая :: /ХВС/Производство/Техническая :: /ХВС/Производство/Питьевая :: /ХВС/Очистка",null,null,"03-08-2011 00:00:00"]
[18,"Республика Башкортостан","Альшеевский муниципальный район","80602000","Гайниямакский сельский совет","80602416","26922298","Федеральное государственное бюджетное учреждение санаторий \"Шафраново\" Министерства здравоохранения Российской Федерации","0202000395","020201001","Оказание услуг в сфере водоснабжения","Подвоз воды :: Техническая :: Питьевая :: Техническая :: Питьевая :: Техническая :: Питьевая :: Очистка","/ХВС/Подвоз воды :: /ХВС/Сбыт/Техническая :: /ХВС/Сбыт/Питьевая :: /ХВС/Транспортировка/Техническая :: /ХВС/Транспортировка/Питьевая :: /ХВС/Производство/Техническая :: /ХВС/Производство/Питьевая :: /ХВС/Очистка",null,null,"03-08-2011 00:00:00"]
[19,"Республика Башкортостан","Альшеевский муниципальный район","80602000","Зеленоклиновский сельский совет","80602418","26922298","Федеральное государственное бюджетное учреждение санаторий \"Шафраново\" Министерства здравоохранения Российской Федерации","0202000395","020201001","Оказание услуг в сфере водоснабжения","Подвоз воды :: Техническая :: Питьевая :: Техническая :: Питьевая :: Техническая :: Питьевая :: Очистка","/ХВС/Подвоз воды :: /ХВС/Сбыт/Техническая :: /ХВС/Сбыт/Питьевая :: /ХВС/Транспортировка/Техническая :: /ХВС/Транспортировка/Питьевая :: /ХВС/Производство/Техническая :: /ХВС/Производство/Питьевая :: /ХВС/Очистка",null,null,"03-08-2011 00:00:00"]
[20,"Республика Башкортостан","Альшеевский муниципальный район","80602000","Ибраевский сельский совет","80602419","26922298","Федеральное государственное бюджетное учреждение санаторий \"Шафраново\" Министерства здравоохранения Российской Федерации","0202000395","020201001","Оказание услуг в сфере водоснабжения","Подвоз воды :: Техническая :: Питьевая :: Техническая :: Питьевая :: Техническая :: Питьевая :: Очистка","/ХВС/Подвоз воды :: /ХВС/Сбыт/Техническая :: /ХВС/Сбыт/Питьевая :: /ХВС/Транспортировка/Техническая :: /ХВС/Транспортировка/Питьевая :: /ХВС/Производство/Техническая :: /ХВС/Производство/Питьевая :: /ХВС/Очистка",null,null,"03-08-2011 00:00:00"]
[21,"Республика Башкортостан","Альшеевский муниципальный район","80602000","Казанский сельский совет","80602422","26922298","Федеральное государственное бюджетное учреждение санаторий \"Шафраново\" Министерства здравоохранения Российской Федерации","0202000395","020201001","Оказание услуг в сфере водоснабжения","Подвоз воды :: Техническая :: Питьевая :: Техническая :: Питьевая :: Техническая :: Питьевая :: Очистка","/ХВС/Подвоз воды :: /ХВС/Сбыт/Техническая :: /ХВС/Сбыт/Питьевая :: /ХВС/Транспортировка/Техническая :: /ХВС/Транспортировка/Питьевая :: /ХВС/Производство/Техническая :: /ХВС/Производство/Питьевая :: /ХВС/Очистка",null,null,"03-08-2011 00:00:00"]
[22,"Республика Башкортостан","Альшеевский муниципальный район","80602000","Кармышевский сельский совет","80602428","26922298","Федеральное государственное бюджетное учреждение санаторий \"Шафраново\" Министерства здравоохранения Российской Федерации","0202000395","020201001","Оказание услуг в сфере водоснабжения","Подвоз воды :: Техническая :: Питьевая :: Техническая :: Питьевая :: Техническая :: Питьевая :: Очистка","/ХВС/Подвоз воды :: /ХВС/Сбыт/Техническая :: /ХВС/Сбыт/Питьевая :: /ХВС/Транспортировка/Техническая :: /ХВС/Транспортировка/Питьевая :: /ХВС/Производство/Техническая :: /ХВС/Производство/Питьевая :: /ХВС/Очистка",null,null,"03-08-2011 00:00:00"]
[23,"Республика Башкортостан","Альшеевский муниципальный район","80602000","Кипчак-Аскаровский сельский совет","80602431","26922298","Федеральное государственное бюджетное учреждение санаторий \"Шафраново\" Министерства здравоохранения Российской Федерации","0202000395","020201001","Оказание услуг в сфере водоснабжения","Подвоз воды :: Техническая :: Питьевая :: Техническая :: Питьевая :: Техническая :: Питьевая :: Очистка","/ХВС/Подвоз воды :: /ХВС/Сбыт/Техническая :: /ХВС/Сбыт/Питьевая :: /ХВС/Транспортировка/Техническая :: /ХВС/Транспортировка/Питьевая :: /ХВС/Производство/Техническая :: /ХВС/Производство/Питьевая :: /ХВС/Очистка",null,null,"03-08-2011 00:00:00"]
[24,"Республика Башкортостан","Альшеевский муниципальный район","80602000","Кызыльский сельский совет","80602437","26922298","Федеральное государственное бюджетное учреждение санаторий \"Шафраново\" Министерства здравоохранения Российской Федерации","0202000395","020201001","Оказание услуг в сфере водоснабжения","Подвоз воды :: Техническая :: Питьевая :: Техническая :: Питьевая :: Техническая :: Питьевая :: Очистка","/ХВС/Подвоз воды :: /ХВС/Сбыт/Техническая :: /ХВС/Сбыт/Питьевая :: /ХВС/Транспортировка/Техническая :: /ХВС/Транспортировка/Питьевая :: /ХВС/Производство/Техническая :: /ХВС/Производство/Питьевая :: /ХВС/Очистка",null,null,"03-08-2011 00:00:00"]
[25,"Республика Башкортостан","Альшеевский муниципальный район","80602000","Мендяновский сельский совет","80602440","26922298","Федеральное государственное бюджетное учреждение санаторий \"Шафраново\" Министерства здравоохранения Российской Федерации","0202000395","020201001","Оказание услуг в сфере водоснабжения","Подвоз воды :: Техническая :: Питьевая :: Техническая :: Питьевая :: Техническая :: Питьевая :: Очистка","/ХВС/Подвоз воды :: /ХВС/Сбыт/Техническая :: /ХВС/Сбыт/Питьевая :: /ХВС/Транспортировка/Техническая :: /ХВС/Транспортировка/Питьевая :: /ХВС/Производство/Техническая :: /ХВС/Производство/Питьевая :: /ХВС/Очистка",null,null,"03-08-2011 00:00:00"]
[26,"Республика Башкортостан","Альшеевский муниципальный район","80602000","Нигматуллинский сельский совет","80602443","26922298","Федеральное государственное бюджетное учреждение санаторий \"Шафраново\" Министерства здравоохранения Российской Федерации","0202000395","020201001","Оказание услуг в сфере водоснабжения","Подвоз воды :: Техническая :: Питьевая :: Техническая :: Питьевая :: Техническая :: Питьевая :: Очистка","/ХВС/Подвоз воды :: /ХВС/Сбыт/Техническая :: /ХВС/Сбыт/Питьевая :: /ХВС/Транспортировка/Техническая :: /ХВС/Транспортировка/Питьевая :: /ХВС/Производство/Техническая :: /ХВС/Производство/Питьевая :: /ХВС/Очистка",null,null,"03-08-2011 00:00:00"]
[27,"Республика Башкортостан","Альшеевский муниципальный район","80602000","Нижнеаврюзовский сельский совет","80602446","26922298","Федеральное государственное бюджетное учреждение санаторий \"Шафраново\" Министерства здравоохранения Российской Федерации","0202000395","020201001","Оказание услуг в сфере водоснабжения","Подвоз воды :: Техническая :: Питьевая :: Техническая :: Питьевая :: Техническая :: Питьевая :: Очистка","/ХВС/Подвоз воды :: /ХВС/Сбыт/Техническая :: /ХВС/Сбыт/Питьевая :: /ХВС/Транспортировка/Техническая :: /ХВС/Транспортировка/Питьевая :: /ХВС/Производство/Техническая :: /ХВС/Производство/Питьевая :: /ХВС/Очистка",null,null,"03-08-2011 00:00:00"]
[28,"Республика Башкортостан","Альшеевский муниципальный район","80602000","Никифаровский сельский совет","80602449","26922298","Федеральное государственное бюджетное учреждение санаторий \"Шафраново\" Министерства здравоохранения Российской Федерации","0202000395","020201001","Оказание услуг в сфере водоснабжения","Подвоз воды :: Техническая :: Питьевая :: Техническая :: Питьевая :: Техническая :: Питьевая :: Очистка","/ХВС/Подвоз воды :: /ХВС/Сбыт/Техническая :: /ХВС/Сбыт/Питьевая :: /ХВС/Транспортировка/Техническая :: /ХВС/Транспортировка/Питьевая :: /ХВС/Производство/Техническая :: /ХВС/Производство/Питьевая :: /ХВС/Очистка",null,null,"03-08-2011 00:00:00"]
[29,"Республика Башкортостан","Альшеевский муниципальный район","80602000","Раевский сельский совет","80602451","26812367","Куйбышевская дирекция  по тепловодоснабжению структурное подразделение Центральной дирекции по тепловодоснабжению филиала ПАО «РЖД»","7708503727","631145034","Оказание услуг в сфере водоснабжения","Питьевая :: Питьевая :: Питьевая","/ХВС/Сбыт/Питьевая :: /ХВС/Транспортировка/Питьевая :: /ХВС/Производство/Питьевая",null,null,"31-12-2017 00:00:00","31-12-2017 00:00:00"]
[30,"Республика Башкортостан","Альшеевский муниципальный район","80602000","Раевский сельский совет","80602451","26812367","Куйбышевская дирекция  по тепловодоснабжению структурное подразделение Центральной дирекции по тепловодоснабжению филиала ПАО «РЖД»","7708503727","631145034","Оказание услуг в сфере водоснабжения","Питьевая","/ХВС/Производство/Питьевая",null,null,"19-10-2016 00:00:00","31-12-2017 00:00:00"]
[31,"Республика Башкортостан","Альшеевский муниципальный район","80602000","Раевский сельский совет","80602451","26812367","Куйбышевская дирекция  по тепловодоснабжению структурное подразделение Центральной дирекции по тепловодоснабжению филиала ПАО «РЖД»","7708503727","631145034","Транспортировка воды","Питьевая :: Питьевая :: Питьевая","/ХВС/Сбыт/Питьевая :: /ХВС/Транспортировка/Питьевая :: /ХВС/Производство/Питьевая",null,null,"31-12-2017 00:00:00","31-12-2017 00:00:00"]
[32,"Республика Башкортостан","Альшеевский муниципальный район","80602000","Раевский сельский совет","80602451","28536502","Раевское МУП ПО МТО \"Агротехснаб\" Альшеевского района Республики Башкортостан","0202006277","020201001","Оказание услуг в сфере водоснабжения","Подвоз воды :: Техническая :: Питьевая :: Техническая :: Питьевая :: Техническая :: Питьевая :: Очистка","/ХВС/Подвоз воды :: /ХВС/Сбыт/Техническая :: /ХВС/Сбыт/Питьевая :: /ХВС/Транспортировка/Техническая :: /ХВС/Транспортировка/Питьевая :: /ХВС/Производство/Техническая :: /ХВС/Производство/Питьевая :: /ХВС/Очистка","27-06-2014 00:00:00",null,"27-06-2014 00:00:00"]
[33,"Республика Башкортостан","Альшеевский муниципальный район","80602000","Раевский сельский совет","80602451","26922298","Федеральное государственное бюджетное учреждение санаторий \"Шафраново\" Министерства здравоохранения Российской Федерации","0202000395","020201001","Оказание услуг в сфере водоснабжения","Подвоз воды :: Техническая :: Питьевая :: Техническая :: Питьевая :: Техническая :: Питьевая :: Очистка","/ХВС/Подвоз воды :: /ХВС/Сбыт/Техническая :: /ХВС/Сбыт/Питьевая :: /ХВС/Транспортировка/Техническая :: /ХВС/Транспортировка/Питьевая :: /ХВС/Производство/Техническая :: /ХВС/Производство/Питьевая :: /ХВС/Очистка",null,null,"03-08-2011 00:00:00"]
[34,"Республика Башкортостан","Альшеевский муниципальный район","80602000","Слаковский сельский совет","80602455","26922298","Федеральное государственное бюджетное учреждение санаторий \"Шафраново\" Министерства здравоохранения Российской Федерации","0202000395","020201001","Оказание услуг в сфере водоснабжения","Подвоз воды :: Техническая :: Питьевая :: Техническая :: Питьевая :: Техническая :: Питьевая :: Очистка","/ХВС/Подвоз воды :: /ХВС/Сбыт/Техническая :: /ХВС/Сбыт/Питьевая :: /ХВС/Транспортировка/Техническая :: /ХВС/Транспортировка/Питьевая :: /ХВС/Производство/Техническая :: /ХВС/Производство/Питьевая :: /ХВС/Очистка",null,null,"03-08-2011 00:00:00"]
[35,"Республика Башкортостан","Альшеевский муниципальный район","80602000","Ташлинский сельский совет","80602458","26922298","Федеральное государственное бюджетное учреждение санаторий \"Шафраново\" Министерства здравоохранения Российской Федерации","0202000395","020201001","Оказание услуг в сфере водоснабжения","Подвоз воды :: Техническая :: Питьевая :: Техническая :: Питьевая :: Техническая :: Питьевая :: Очистка","/ХВС/Подвоз воды :: /ХВС/Сбыт/Техническая :: /ХВС/Сбыт/Питьевая :: /ХВС/Транспортировка/Техническая :: /ХВС/Транспортировка/Питьевая :: /ХВС/Производство/Техническая :: /ХВС/Производство/Питьевая :: /ХВС/Очистка",null,null,"03-08-2011 00:00:00"]
[36,"Республика Башкортостан","Альшеевский муниципальный район","80602000","Трунтаишевский сельский совет","80602461","26922298","Федеральное государственное бюджетное учреждение санаторий \"Шафраново\" Министерства здравоохранения Российской Федерации","0202000395","020201001","Оказание услуг в сфере водоснабжения","Подвоз воды :: Техническая :: Питьевая :: Техническая :: Питьевая :: Техническая :: Питьевая :: Очистка","/ХВС/Подвоз воды :: /ХВС/Сбыт/Техническая :: /ХВС/Сбыт/Питьевая :: /ХВС/Транспортировка/Техническая :: /ХВС/Транспортировка/Питьевая :: /ХВС/Производство/Техническая :: /ХВС/Производство/Питьевая :: /ХВС/Очистка",null,null,"03-08-2011 00:00:00"]
[37,"Республика Башкортостан","Альшеевский муниципальный район","80602000","Чебенлинский сельский совет","80602464","26922298","Федеральное государственное бюджетное учреждение санаторий \"Шафраново\" Министерства здравоохранения Российской Федерации","0202000395","020201001","Оказание услуг в сфере водоснабжения","Подвоз воды :: Техническая :: Питьевая :: Техническая :: Питьевая :: Техническая :: Питьевая :: Очистка","/ХВС/Подвоз воды :: /ХВС/Сбыт/Техническая :: /ХВС/Сбыт/Питьевая :: /ХВС/Транспортировка/Техническая :: /ХВС/Транспортировка/Питьевая :: /ХВС/Производство/Техническая :: /ХВС/Производство/Питьевая :: /ХВС/Очистка",null,null,"03-08-2011 00:00:00"]
[38,"Республика Башкортостан","Альшеевский муниципальный район","80602000","Шафрановский сельский совет","80602470","30390648","Общество с ограниченной ответственностью \"Калипсо\"","0202009920","020245009","Оказание услуг в сфере водоснабжения","Питьевая :: Питьевая :: Очистка","/ХВС/Сбыт/Питьевая :: /ХВС/Производство/Питьевая :: /ХВС/Очистка","20-01-2016 00:00:00",null,"20-01-2016 00:00:00"]
[39,"Республика Башкортостан","Альшеевский муниципальный район","80602000","Шафрановский сельский совет","80602470","26922298","Федеральное государственное бюджетное учреждение санаторий \"Шафраново\" Министерства здравоохранения Российской Федерации","0202000395","020201001","Оказание услуг в сфере водоснабжения","Подвоз воды :: Техническая :: Питьевая :: Техническая :: Питьевая :: Техническая :: Питьевая :: Очистка","/ХВС/Подвоз воды :: /ХВС/Сбыт/Техническая :: /ХВС/Сбыт/Питьевая :: /ХВС/Транспортировка/Техническая :: /ХВС/Транспортировка/Питьевая :: /ХВС/Производство/Техническая :: /ХВС/Производство/Питьевая :: /ХВС/Очистка",null,null,"03-08-2011 00:00:00"]
[40,"Республика Башкортостан","Архангельский муниципальный район","80603000","Архангельский сельский совет","80603410","26471836","ООО \"Водник\" Архангельский","0203004064","020301001","Оказание услуг в сфере водоснабжения","Подвоз воды :: Техническая :: Питьевая :: Техническая :: Питьевая :: Техническая :: Питьевая :: Очистка","/ХВС/Подвоз воды :: /ХВС/Сбыт/Техническая :: /ХВС/Сбыт/Питьевая :: /ХВС/Транспортировка/Техническая :: /ХВС/Транспортировка/Питьевая :: /ХВС/Производство/Техническая :: /ХВС/Производство/Питьевая :: /ХВС/Очистка",null,null,"15-01-2010 00:00:00"]
[41,"Республика Башкортостан","Архангельский муниципальный район","80603000","Архангельский сельский совет","80603410","27687958","ООО Строй-Комфорт","0203003938","020301001","Оказание услуг в сфере водоснабжения","Подвоз воды :: Техническая :: Питьевая :: Техническая :: Питьевая :: Техническая :: Питьевая :: Очистка","/ХВС/Подвоз воды :: /ХВС/Сбыт/Техническая :: /ХВС/Сбыт/Питьевая :: /ХВС/Транспортировка/Техническая :: /ХВС/Транспортировка/Питьевая :: /ХВС/Производство/Техническая :: /ХВС/Производство/Питьевая :: /ХВС/Очистка","05-05-2012 00:00:00",null,"05-05-2012 00:00:00"]
[42,"Республика Башкортостан","Архангельский муниципальный район","80603000","Тавакачевский сельский совет","80603446","27687958","ООО Строй-Комфорт","0203003938","020301001","Оказание услуг в сфере водоснабжения","Подвоз воды :: Техническая :: Питьевая :: Техническая :: Питьевая :: Техническая :: Питьевая :: Очистка","/ХВС/Подвоз воды :: /ХВС/Сбыт/Техническая :: /ХВС/Сбыт/Питьевая :: /ХВС/Транспортировка/Техническая :: /ХВС/Транспортировка/Питьевая :: /ХВС/Производство/Техническая :: /ХВС/Производство/Питьевая :: /ХВС/Очистка","05-05-2012 00:00:00",null,"05-05-2012 00:00:00"]
[43,"Республика Башкортостан","Аскинский муниципальный район","80604000","Аскинский сельский совет","80604404","26471842","ООО \"КомСервис\"","0204004807","020401001","Оказание услуг в сфере водоснабжения","Техническая :: Питьевая :: Техническая :: Питьевая :: Техническая :: Питьевая","/ХВС/Сбыт/Техническая :: /ХВС/Сбыт/Питьевая :: /ХВС/Транспортировка/Техническая :: /ХВС/Транспортировка/Питьевая :: /ХВС/Производство/Техническая :: /ХВС/Производство/Питьевая",null,null,"15-01-2010 00:00:00"]
[44,"Республика Башкортостан","Аскинский муниципальный район","80604000","Аскинский сельский совет","80604404","26471842","ООО \"КомСервис\"","0204004807","020401001","Транспортировка воды","Техническая :: Питьевая :: Техническая :: Питьевая :: Техническая :: Питьевая","/ХВС/Сбыт/Техническая :: /ХВС/Сбыт/Питьевая :: /ХВС/Транспортировка/Техническая :: /ХВС/Транспортировка/Питьевая :: /ХВС/Производство/Техническая :: /ХВС/Производство/Питьевая",null,null,"15-01-2010 00:00:00"]
[45,"Республика Башкортостан","Аургазинский муниципальный район","80605000","Нагадакский сельский совет","80605428","26812367","Куйбышевская дирекция  по тепловодоснабжению структурное подразделение Центральной дирекции по тепловодоснабжению филиала ПАО «РЖД»","7708503727","631145034","Оказание услуг в сфере водоснабжения","Питьевая :: Питьевая :: Питьевая","/ХВС/Сбыт/Питьевая :: /ХВС/Транспортировка/Питьевая :: /ХВС/Производство/Питьевая",null,null,"31-12-2017 00:00:00","31-12-2017 00:00:00"]
[46,"Республика Башкортостан","Аургазинский муниципальный район","80605000","Нагадакский сельский совет","80605428","26812367","Куйбышевская дирекция  по тепловодоснабжению структурное подразделение Центральной дирекции по тепловодоснабжению филиала ПАО «РЖД»","7708503727","631145034","Транспортировка воды","Питьевая :: Питьевая :: Питьевая","/ХВС/Сбыт/Питьевая :: /ХВС/Транспортировка/Питьевая :: /ХВС/Производство/Питьевая",null,null,"31-12-2017 00:00:00","31-12-2017 00:00:00"]
[47,"Республика Башкортостан","Аургазинский муниципальный район","80605000","Нагадакский сельский совет","80605428","26812367","Куйбышевская дирекция  по тепловодоснабжению структурное подразделение Центральной дирекции по тепловодоснабжению филиала ПАО «РЖД»","7708503727","631145034","Оказание услуг в сфере водоснабжения","Питьевая","/ХВС/Производство/Питьевая",null,null,"19-10-2016 00:00:00","31-12-2017 00:00:00"]
[48,"Республика Башкортостан","Аургазинский муниципальный район","80605000","Семенкинский сельский совет","80605434","26761481","ООО \"КХ Шиповник\"","0205007215","020501001","Оказание услуг в сфере водоснабжения","Подвоз воды :: Техническая :: Питьевая :: Техническая :: Питьевая :: Техническая :: Питьевая :: Очистка","/ХВС/Подвоз воды :: /ХВС/Сбыт/Техническая :: /ХВС/Сбыт/Питьевая :: /ХВС/Транспортировка/Техническая :: /ХВС/Транспортировка/Питьевая :: /ХВС/Производство/Техническая :: /ХВС/Производство/Питьевая :: /ХВС/Очистка",null,null,"02-02-2011 00:00:00"]
[49,"Республика Башкортостан","Аургазинский муниципальный район","80605000","Толбазинский сельский совет","80605446","30434174","МУП \"АУРГАЗЫ-ВОДОКАНАЛ\"","0205007896","020501001","Оказание услуг в сфере водоснабжения","Питьевая :: Питьевая :: Очистка","/ХВС/Сбыт/Питьевая :: /ХВС/Производство/Питьевая :: /ХВС/Очистка","24-03-2016 00:00:00",null,"24-03-2016 00:00:00"]
[50,"Республика Башкортостан","Аургазинский муниципальный район","80605000","Чуваш-Карамалинский сельский совет","80605472","26812367","Куйбышевская дирекция  по тепловодоснабжению структурное подразделение Центральной дирекции по тепловодоснабжению филиала ПАО «РЖД»","7708503727","631145034","Оказание услуг в сфере водоснабжения","Питьевая","/ХВС/Производство/Питьевая",null,null,"19-10-2016 00:00:00","31-12-2017 00:00:00"]
[51,"Республика Башкортостан","Аургазинский муниципальный район","80605000","Чуваш-Карамалинский сельский совет","80605472","26812367","Куйбышевская дирекция  по тепловодоснабжению структурное подразделение Центральной дирекции по тепловодоснабжению филиала ПАО «РЖД»","7708503727","631145034","Транспортировка воды","Питьевая :: Питьевая :: Питьевая","/ХВС/Сбыт/Питьевая :: /ХВС/Транспортировка/Питьевая :: /ХВС/Производство/Питьевая",null,null,"31-12-2017 00:00:00","31-12-2017 00:00:00"]
[52,"Республика Башкортостан","Аургазинский муниципальный район","80605000","Чуваш-Карамалинский сельский совет","80605472","26812367","Куйбышевская дирекция  по тепловодоснабжению структурное подразделение Центральной дирекции по тепловодоснабжению филиала ПАО «РЖД»","7708503727","631145034","Оказание услуг в сфере водоснабжения","Питьевая :: Питьевая :: Питьевая","/ХВС/Сбыт/Питьевая :: /ХВС/Транспортировка/Питьевая :: /ХВС/Производство/Питьевая",null,null,"31-12-2017 00:00:00","31-12-2017 00:00:00"]
[53,"Республика Башкортостан","Баймакский муниципальный район","80606000","Город Баймак","80606101","31099879","МУП «Баймакский Водоканал»","0254027373","025401001","Транспортировка воды","Питьевая :: Питьевая :: Питьевая :: Очистка","/ХВС/Сбыт/Питьевая :: /ХВС/Транспортировка/Питьевая :: /ХВС/Производство/Питьевая :: /ХВС/Очистка","13-06-2018 00:00:00",null,"13-06-2018 00:00:00"]
[54,"Республика Башкортостан","Баймакский муниципальный район","80606000","Город Баймак","80606101","31099879","МУП «Баймакский Водоканал»","0254027373","025401001","Оказание услуг в сфере водоснабжения","Питьевая :: Питьевая :: Питьевая :: Очистка","/ХВС/Сбыт/Питьевая :: /ХВС/Транспортировка/Питьевая :: /ХВС/Производство/Питьевая :: /ХВС/Очистка","13-06-2018 00:00:00",null,"13-06-2018 00:00:00"]
[55,"Республика Башкортостан","Баймакский муниципальный район","80606000","Город Баймак","80606101","26758794","ООО «Водоканал» (Баймакский МР)","0254011302","025401001","Транспортировка воды","Техническая :: Питьевая :: Техническая :: Питьевая :: Техническая :: Питьевая","/ХВС/Сбыт/Техническая :: /ХВС/Сбыт/Питьевая :: /ХВС/Транспортировка/Техническая :: /ХВС/Транспортировка/Питьевая :: /ХВС/Производство/Техническая :: /ХВС/Производство/Питьевая",null,null,"31-01-2011 00:00:00"]
[56,"Республика Башкортостан","Баймакский муниципальный район","80606000","Город Баймак","80606101","26758794","ООО «Водоканал» (Баймакский МР)","0254011302","025401001","Оказание услуг в сфере водоснабжения","Техническая :: Питьевая :: Техническая :: Питьевая :: Техническая :: Питьевая","/ХВС/Сбыт/Техническая :: /ХВС/Сбыт/Питьевая :: /ХВС/Транспортировка/Техническая :: /ХВС/Транспортировка/Питьевая :: /ХВС/Производство/Техническая :: /ХВС/Производство/Питьевая",null,null,"31-01-2011 00:00:00"]
[57,"Республика Башкортостан","Баймакский муниципальный район","80606000","Сибайский сельский совет","80606443","27570395","МУП ЖЭУ \"Сибайское\" РБ","0254009536","025401001","Оказание услуг в сфере водоснабжения","Подвоз воды :: Техническая :: Питьевая :: Техническая :: Питьевая :: Техническая :: Питьевая :: Очистка","/ХВС/Подвоз воды :: /ХВС/Сбыт/Техническая :: /ХВС/Сбыт/Питьевая :: /ХВС/Транспортировка/Техническая :: /ХВС/Транспортировка/Питьевая :: /ХВС/Производство/Техническая :: /ХВС/Производство/Питьевая :: /ХВС/Очистка",null,null,"12-01-2012 00:00:00"]
[58,"Республика Башкортостан","Бакалинский муниципальный район","80607000","Бакалинский сельский совет","80607407","26471886","МУП \"Коммунхоз\"","0207005936","020701001","Оказание услуг в сфере водоснабжения","Подвоз воды :: Техническая :: Питьевая :: Техническая :: Питьевая :: Техническая :: Питьевая :: Очистка","/ХВС/Подвоз воды :: /ХВС/Сбыт/Техническая :: /ХВС/Сбыт/Питьевая :: /ХВС/Транспортировка/Техническая :: /ХВС/Транспортировка/Питьевая :: /ХВС/Производство/Техническая :: /ХВС/Производство/Питьевая :: /ХВС/Очистка",null,null,"15-01-2010 00:00:00"]
[59,"Республика Башкортостан","Балтачевский муниципальный район","80608000","Старобалтачевский сельский совет","80608431","26754383","ООО «Коммунальное хозяйство»","0208005015","020801001","Оказание услуг в сфере водоснабжения","Подвоз воды :: Техническая :: Питьевая :: Техническая :: Питьевая :: Техническая :: Питьевая :: Очистка","/ХВС/Подвоз воды :: /ХВС/Сбыт/Техническая :: /ХВС/Сбыт/Питьевая :: /ХВС/Транспортировка/Техническая :: /ХВС/Транспортировка/Питьевая :: /ХВС/Производство/Техническая :: /ХВС/Производство/Питьевая :: /ХВС/Очистка",null,null,"25-01-2011 00:00:00"]
[60,"Республика Башкортостан","Белебеевский муниципальный район","80609000","Аксаковский сельский совет","80609401","26812367","Куйбышевская дирекция  по тепловодоснабжению структурное подразделение Центральной дирекции по тепловодоснабжению филиала ПАО «РЖД»","7708503727","631145034","Транспортировка воды","Питьевая :: Питьевая :: Питьевая","/ХВС/Сбыт/Питьевая :: /ХВС/Транспортировка/Питьевая :: /ХВС/Производство/Питьевая",null,null,"31-12-2017 00:00:00","31-12-2017 00:00:00"]
[61,"Республика Башкортостан","Белебеевский муниципальный район","80609000","Аксаковский сельский совет","80609401","26812367","Куйбышевская дирекция  по тепловодоснабжению структурное подразделение Центральной дирекции по тепловодоснабжению филиала ПАО «РЖД»","7708503727","631145034","Оказание услуг в сфере водоснабжения","Питьевая :: Питьевая :: Питьевая","/ХВС/Сбыт/Питьевая :: /ХВС/Транспортировка/Питьевая :: /ХВС/Производство/Питьевая",null,null,"31-12-2017 00:00:00","31-12-2017 00:00:00"]
[62,"Республика Башкортостан","Белебеевский муниципальный район","80609000","Аксаковский сельский совет","80609401","26812367","Куйбышевская дирекция  по тепловодоснабжению структурное подразделение Центральной дирекции по тепловодоснабжению филиала ПАО «РЖД»","7708503727","631145034","Оказание услуг в сфере водоснабжения","Питьевая","/ХВС/Производство/Питьевая",null,null,"19-10-2016 00:00:00","31-12-2017 00:00:00"]
[63,"Республика Башкортостан","Белебеевский муниципальный район","80609000","Аксаковский сельский совет","80609401","26471913","ООО \"Белебеевский водоканал\"","0255014715","025501001","Транспортировка воды","Питьевая :: Питьевая :: Питьевая","/ХВС/Сбыт/Питьевая :: /ХВС/Транспортировка/Питьевая :: /ХВС/Производство/Питьевая",null,null,"28-07-2016 00:00:00"]
[64,"Республика Башкортостан","Белебеевский муниципальный район","80609000","Аксаковский сельский совет","80609401","26471913","ООО \"Белебеевский водоканал\"","0255014715","025501001","Оказание услуг в сфере водоснабжения","Питьевая :: Питьевая :: Питьевая","/ХВС/Сбыт/Питьевая :: /ХВС/Транспортировка/Питьевая :: /ХВС/Производство/Питьевая",null,null,"28-07-2016 00:00:00"]
[65,"Республика Башкортостан","Белебеевский муниципальный район","80609000","Аксаковский сельский совет","80609401","26471890","ФГБУ санаторий им. С.Т. Аксакова Минздрава России","0255002773","025501001","Оказание услуг в сфере водоснабжения","Подвоз воды :: Техническая :: Питьевая :: Техническая :: Питьевая :: Техническая :: Питьевая :: Очистка","/ХВС/Подвоз воды :: /ХВС/Сбыт/Техническая :: /ХВС/Сбыт/Питьевая :: /ХВС/Транспортировка/Техническая :: /ХВС/Транспортировка/Питьевая :: /ХВС/Производство/Техническая :: /ХВС/Производство/Питьевая :: /ХВС/Очистка",null,null,"15-01-2010 00:00:00"]
[66,"Республика Башкортостан","Белебеевский муниципальный район","80609000","Баженовский сельский совет","80609402","26797517","ООО \"УК Баженово\"","0255015998","025501001","Оказание услуг в сфере водоснабжения","Подвоз воды :: Техническая :: Питьевая :: Техническая :: Питьевая :: Техническая :: Питьевая :: Очистка","/ХВС/Подвоз воды :: /ХВС/Сбыт/Техническая :: /ХВС/Сбыт/Питьевая :: /ХВС/Транспортировка/Техническая :: /ХВС/Транспортировка/Питьевая :: /ХВС/Производство/Техническая :: /ХВС/Производство/Питьевая :: /ХВС/Очистка",null,null,"24-03-2011 00:00:00","31-12-2017 00:00:00"]
[67,"Республика Башкортостан","Белебеевский муниципальный район","80609000","Город Белебей","80609101","30335229","АО \"ГУ ЖКХ\"","5116000922","770401001","Оказание услуг в сфере водоснабжения","Питьевая","/ХВС/Производство/Питьевая",null,null,"08-10-2015 00:00:00","31-12-2017 00:00:00"]
[68,"Республика Башкортостан","Белебеевский муниципальный район","80609000","Город Белебей","80609101","30791606","АО \"ГУ ЖКХ\"","5116000922","166045001","Оказание услуг в сфере водоснабжения","Питьевая","/ХВС/Производство/Питьевая",null,null,"02-09-2016 00:00:00","31-12-2017 00:00:00"]
[69,"Республика Башкортостан","Белебеевский муниципальный район","80609000","Город Белебей","80609101","26579145","ОАО \"Белебеевский завод \"Автонормаль\"","0255010527","025250001","Оказание услуг в сфере водоснабжения","Подвоз воды :: Техническая :: Питьевая :: Техническая :: Питьевая :: Техническая :: Питьевая :: Очистка","/ХВС/Подвоз воды :: /ХВС/Сбыт/Техническая :: /ХВС/Сбыт/Питьевая :: /ХВС/Транспортировка/Техническая :: /ХВС/Транспортировка/Питьевая :: /ХВС/Производство/Техническая :: /ХВС/Производство/Питьевая :: /ХВС/Очистка",null,null,"27-10-2010 00:00:00"]
[70,"Республика Башкортостан","Белебеевский муниципальный район","80609000","Город Белебей","80609101","26797507","ОАО \"Племптицесовхоз Знаменский РБ\"","0255016529","025501001","Транспортировка воды","Техническая :: Питьевая :: Техническая :: Питьевая :: Техническая :: Питьевая","/ХВС/Сбыт/Техническая :: /ХВС/Сбыт/Питьевая :: /ХВС/Транспортировка/Техническая :: /ХВС/Транспортировка/Питьевая :: /ХВС/Производство/Техническая :: /ХВС/Производство/Питьевая",null,null,"24-03-2011 00:00:00","31-12-2017 00:00:00"]
[71,"Республика Башкортостан","Белебеевский муниципальный район","80609000","Город Белебей","80609101","26797507","ОАО \"Племптицесовхоз Знаменский РБ\"","0255016529","025501001","Оказание услуг в сфере водоснабжения","Техническая :: Питьевая :: Техническая :: Питьевая :: Техническая :: Питьевая","/ХВС/Сбыт/Техническая :: /ХВС/Сбыт/Питьевая :: /ХВС/Транспортировка/Техническая :: /ХВС/Транспортировка/Питьевая :: /ХВС/Производство/Техническая :: /ХВС/Производство/Питьевая",null,null,"24-03-2011 00:00:00","31-12-2017 00:00:00"]
[72,"Республика Башкортостан","Белебеевский муниципальный район","80609000","Город Белебей","80609101","26471913","ООО \"Белебеевский водоканал\"","0255014715","025501001","Оказание услуг в сфере водоснабжения","Техническая :: Питьевая :: Техническая :: Питьевая :: Техническая :: Питьевая","/ХВС/Сбыт/Техническая :: /ХВС/Сбыт/Питьевая :: /ХВС/Транспортировка/Техническая :: /ХВС/Транспортировка/Питьевая :: /ХВС/Производство/Техническая :: /ХВС/Производство/Питьевая",null,null,"15-01-2010 00:00:00"]
[73,"Республика Башкортостан","Белебеевский муниципальный район","80609000","Город Белебей","80609101","26471913","ООО \"Белебеевский водоканал\"","0255014715","025501001","Транспортировка воды","Техническая :: Питьевая :: Техническая :: Питьевая :: Техническая :: Питьевая","/ХВС/Сбыт/Техническая :: /ХВС/Сбыт/Питьевая :: /ХВС/Транспортировка/Техническая :: /ХВС/Транспортировка/Питьевая :: /ХВС/Производство/Техническая :: /ХВС/Производство/Питьевая",null,null,"15-01-2010 00:00:00"]
[74,"Республика Башкортостан","Белебеевский муниципальный район","80609000","Максим-Горьковский сельский совет","80609416","30839090","ООО \"Живой родник\"","0255018195","025501001","Оказание услуг в сфере водоснабжения","Питьевая :: Питьевая :: Питьевая","/ХВС/Сбыт/Питьевая :: /ХВС/Транспортировка/Питьевая :: /ХВС/Производство/Питьевая",null,null,"29-09-2016 00:00:00"]
[75,"Республика Башкортостан","Белебеевский муниципальный район","80609000","Максим-Горьковский сельский совет","80609416","30839090","ООО \"Живой родник\"","0255018195","025501001","Транспортировка воды","Питьевая :: Питьевая :: Питьевая","/ХВС/Сбыт/Питьевая :: /ХВС/Транспортировка/Питьевая :: /ХВС/Производство/Питьевая",null,null,"29-09-2016 00:00:00"]
[76,"Республика Башкортостан","Белебеевский муниципальный район","80609000","Максим-Горьковский сельский совет","80609416","26453060","ФГБУ санаторий \"Глуховская\" Минздрава России","0209001038","025501001","Оказание услуг в сфере водоснабжения","Подвоз воды :: Техническая :: Питьевая :: Техническая :: Питьевая :: Техническая :: Питьевая :: Очистка","/ХВС/Подвоз воды :: /ХВС/Сбыт/Техническая :: /ХВС/Сбыт/Питьевая :: /ХВС/Транспортировка/Техническая :: /ХВС/Транспортировка/Питьевая :: /ХВС/Производство/Техническая :: /ХВС/Производство/Питьевая :: /ХВС/Очистка",null,null,"10-12-2009 00:00:00"]
[77,"Республика Башкортостан","Белебеевский муниципальный район","80609000","Малиновский сельский совет","80609419","26471897","СПК \"Малиновка\" Белебеевский МР","0209004127","025501001","Оказание услуг в сфере водоснабжения","Техническая :: Питьевая :: Техническая :: Питьевая :: Техническая :: Питьевая","/ХВС/Сбыт/Техническая :: /ХВС/Сбыт/Питьевая :: /ХВС/Транспортировка/Техническая :: /ХВС/Транспортировка/Питьевая :: /ХВС/Производство/Техническая :: /ХВС/Производство/Питьевая",null,null,"15-01-2010 00:00:00"]
[78,"Республика Башкортостан","Белебеевский муниципальный район","80609000","Малиновский сельский совет","80609419","26471897","СПК \"Малиновка\" Белебеевский МР","0209004127","025501001","Транспортировка воды","Техническая :: Питьевая :: Техническая :: Питьевая :: Техническая :: Питьевая","/ХВС/Сбыт/Техническая :: /ХВС/Сбыт/Питьевая :: /ХВС/Транспортировка/Техническая :: /ХВС/Транспортировка/Питьевая :: /ХВС/Производство/Техническая :: /ХВС/Производство/Питьевая",null,null,"15-01-2010 00:00:00"]
[79,"Республика Башкортостан","Белебеевский муниципальный район","80609000","Приютовский поссовет","80609165","26812367","Куйбышевская дирекция  по тепловодоснабжению структурное подразделение Центральной дирекции по тепловодоснабжению филиала ПАО «РЖД»","7708503727","631145034","Оказание услуг в сфере водоснабжения","Питьевая :: Питьевая :: Питьевая","/ХВС/Сбыт/Питьевая :: /ХВС/Транспортировка/Питьевая :: /ХВС/Производство/Питьевая",null,null,"31-12-2017 00:00:00","31-12-2017 00:00:00"]
[80,"Республика Башкортостан","Белебеевский муниципальный район","80609000","Приютовский поссовет","80609165","26812367","Куйбышевская дирекция  по тепловодоснабжению структурное подразделение Центральной дирекции по тепловодоснабжению филиала ПАО «РЖД»","7708503727","631145034","Оказание услуг в сфере водоснабжения","Питьевая","/ХВС/Производство/Питьевая",null,null,"19-10-2016 00:00:00","31-12-2017 00:00:00"]
[81,"Республика Башкортостан","Белебеевский муниципальный район","80609000","Приютовский поссовет","80609165","26812367","Куйбышевская дирекция  по тепловодоснабжению структурное подразделение Центральной дирекции по тепловодоснабжению филиала ПАО «РЖД»","7708503727","631145034","Транспортировка воды","Питьевая :: Питьевая :: Питьевая","/ХВС/Сбыт/Питьевая :: /ХВС/Транспортировка/Питьевая :: /ХВС/Производство/Питьевая",null,null,"31-12-2017 00:00:00","31-12-2017 00:00:00"]
[82,"Республика Башкортостан","Белебеевский муниципальный район","80609000","Приютовский поссовет","80609165","26471913","ООО \"Белебеевский водоканал\"","0255014715","025501001","Транспортировка воды","Питьевая :: Питьевая :: Питьевая","/ХВС/Сбыт/Питьевая :: /ХВС/Транспортировка/Питьевая :: /ХВС/Производство/Питьевая",null,null,"28-07-2016 00:00:00"]
[83,"Республика Башкортостан","Белебеевский муниципальный район","80609000","Приютовский поссовет","80609165","26471913","ООО \"Белебеевский водоканал\"","0255014715","025501001","Оказание услуг в сфере водоснабжения","Питьевая :: Питьевая :: Питьевая","/ХВС/Сбыт/Питьевая :: /ХВС/Транспортировка/Питьевая :: /ХВС/Производство/Питьевая",null,null,"28-07-2016 00:00:00"]
[84,"Республика Башкортостан","Белебеевский муниципальный район","80609000","Шаровский сельский совет","80609443","26812367","Куйбышевская дирекция  по тепловодоснабжению структурное подразделение Центральной дирекции по тепловодоснабжению филиала ПАО «РЖД»","7708503727","631145034","Оказание услуг в сфере водоснабжения","Питьевая","/ХВС/Производство/Питьевая",null,null,"19-10-2016 00:00:00","31-12-2017 00:00:00"]
[85,"Республика Башкортостан","Белебеевский муниципальный район","80609000","Шаровский сельский совет","80609443","26812367","Куйбышевская дирекция  по тепловодоснабжению структурное подразделение Центральной дирекции по тепловодоснабжению филиала ПАО «РЖД»","7708503727","631145034","Оказание услуг в сфере водоснабжения","Питьевая :: Питьевая","/ХВС/Транспортировка/Питьевая :: /ХВС/Производство/Питьевая",null,null,"31-12-2017 00:00:00","31-12-2017 00:00:00"]
[86,"Республика Башкортостан","Белебеевский муниципальный район","80609000","Шаровский сельский совет","80609443","26812367","Куйбышевская дирекция  по тепловодоснабжению структурное подразделение Центральной дирекции по тепловодоснабжению филиала ПАО «РЖД»","7708503727","631145034","Транспортировка воды","Питьевая :: Питьевая","/ХВС/Транспортировка/Питьевая :: /ХВС/Производство/Питьевая",null,null,"31-12-2017 00:00:00","31-12-2017 00:00:00"]
[87,"Республика Башкортостан","Белокатайский муниципальный район","80610000","Новобелокатайский сельский совет","80610422","26453118","ООО ЖКХ \"Ургалинское\" МР Белокатайский район","0210027577","021001001","Транспортировка воды","Техническая :: Питьевая :: Техническая :: Питьевая :: Техническая :: Питьевая","/ХВС/Сбыт/Техническая :: /ХВС/Сбыт/Питьевая :: /ХВС/Транспортировка/Техническая :: /ХВС/Транспортировка/Питьевая :: /ХВС/Производство/Техническая :: /ХВС/Производство/Питьевая",null,null,"12-07-2016 00:00:00"]
[88,"Республика Башкортостан","Белокатайский муниципальный район","80610000","Новобелокатайский сельский совет","80610422","26453118","ООО ЖКХ \"Ургалинское\" МР Белокатайский район","0210027577","021001001","Оказание услуг в сфере водоснабжения","Техническая :: Питьевая :: Техническая :: Питьевая :: Техническая :: Питьевая","/ХВС/Сбыт/Техническая :: /ХВС/Сбыт/Питьевая :: /ХВС/Транспортировка/Техническая :: /ХВС/Транспортировка/Питьевая :: /ХВС/Производство/Техническая :: /ХВС/Производство/Питьевая",null,null,"12-07-2016 00:00:00"]
[89,"Республика Башкортостан","Белокатайский муниципальный район","80610000","Ургалинский сельский совет","80610434","26453118","ООО ЖКХ \"Ургалинское\" МР Белокатайский район","0210027577","021001001","Транспортировка воды","Техническая :: Питьевая :: Техническая :: Питьевая :: Техническая :: Питьевая","/ХВС/Сбыт/Техническая :: /ХВС/Сбыт/Питьевая :: /ХВС/Транспортировка/Техническая :: /ХВС/Транспортировка/Питьевая :: /ХВС/Производство/Техническая :: /ХВС/Производство/Питьевая",null,null,"10-12-2009 00:00:00"]
[90,"Республика Башкортостан","Белокатайский муниципальный район","80610000","Ургалинский сельский совет","80610434","26453118","ООО ЖКХ \"Ургалинское\" МР Белокатайский район","0210027577","021001001","Оказание услуг в сфере водоснабжения","Техническая :: Питьевая :: Техническая :: Питьевая :: Техническая :: Питьевая","/ХВС/Сбыт/Техническая :: /ХВС/Сбыт/Питьевая :: /ХВС/Транспортировка/Техническая :: /ХВС/Транспортировка/Питьевая :: /ХВС/Производство/Техническая :: /ХВС/Производство/Питьевая",null,null,"10-12-2009 00:00:00"]
[91,"Республика Башкортостан","Белорецкий муниципальный район","80611000","Абзаковский сельский совет","80611404","26453470","ООО \"Абзаково\"","0256014475","025601001","Оказание услуг в сфере водоснабжения","Подвоз воды :: Техническая :: Питьевая :: Техническая :: Питьевая :: Техническая :: Питьевая :: Очистка","/ХВС/Подвоз воды :: /ХВС/Сбыт/Техническая :: /ХВС/Сбыт/Питьевая :: /ХВС/Транспортировка/Техническая :: /ХВС/Транспортировка/Питьевая :: /ХВС/Производство/Техническая :: /ХВС/Производство/Питьевая :: /ХВС/Очистка",null,null,"10-12-2009 00:00:00"]
[92,"Республика Башкортостан","Белорецкий муниципальный район","80611000","Абзаковский сельский совет","80611404","30873301","ООО САНАТОРИЙ \"АССЫ\"","0256996711","025601001","Оказание услуг в сфере водоснабжения","Подвоз воды :: Техническая :: Питьевая :: Техническая :: Питьевая :: Питьевая :: Очистка","/ХВС/Подвоз воды :: /ХВС/Сбыт/Техническая :: /ХВС/Сбыт/Питьевая :: /ХВС/Транспортировка/Техническая :: /ХВС/Транспортировка/Питьевая :: /ХВС/Производство/Питьевая :: /ХВС/Очистка","24-01-2017 00:00:00",null,"01-01-2017 00:00:00"]
[93,"Республика Башкортостан","Белорецкий муниципальный район","80611000","Азикеевский сельский совет","80611407","30873301","ООО САНАТОРИЙ \"АССЫ\"","0256996711","025601001","Оказание услуг в сфере водоснабжения","Подвоз воды :: Техническая :: Питьевая :: Техническая :: Питьевая :: Питьевая :: Очистка","/ХВС/Подвоз воды :: /ХВС/Сбыт/Техническая :: /ХВС/Сбыт/Питьевая :: /ХВС/Транспортировка/Техническая :: /ХВС/Транспортировка/Питьевая :: /ХВС/Производство/Питьевая :: /ХВС/Очистка","24-01-2017 00:00:00",null,"01-01-2017 00:00:00"]
[94,"Республика Башкортостан","Белорецкий муниципальный район","80611000","Ассинский сельский совет","80611410","26471917","ГУП санаторий Ассы","0256013979","025601001","Транспортировка воды","Техническая :: Питьевая :: Техническая :: Питьевая :: Техническая :: Питьевая","/ХВС/Сбыт/Техническая :: /ХВС/Сбыт/Питьевая :: /ХВС/Транспортировка/Техническая :: /ХВС/Транспортировка/Питьевая :: /ХВС/Производство/Техническая :: /ХВС/Производство/Питьевая",null,null,"15-01-2010 00:00:00","31-12-2017 00:00:00"]
[95,"Республика Башкортостан","Белорецкий муниципальный район","80611000","Ассинский сельский совет","80611410","26471917","ГУП санаторий Ассы","0256013979","025601001","Оказание услуг в сфере водоснабжения","Техническая :: Питьевая :: Техническая :: Питьевая :: Техническая :: Питьевая","/ХВС/Сбыт/Техническая :: /ХВС/Сбыт/Питьевая :: /ХВС/Транспортировка/Техническая :: /ХВС/Транспортировка/Питьевая :: /ХВС/Производство/Техническая :: /ХВС/Производство/Питьевая",null,null,"15-01-2010 00:00:00","31-12-2017 00:00:00"]
[96,"Республика Башкортостан","Белорецкий муниципальный район","80611000","Ассинский сельский совет","80611410","30873301","ООО САНАТОРИЙ \"АССЫ\"","0256996711","025601001","Оказание услуг в сфере водоснабжения","Подвоз воды :: Техническая :: Питьевая :: Техническая :: Питьевая :: Питьевая :: Очистка","/ХВС/Подвоз воды :: /ХВС/Сбыт/Техническая :: /ХВС/Сбыт/Питьевая :: /ХВС/Транспортировка/Техническая :: /ХВС/Транспортировка/Питьевая :: /ХВС/Производство/Питьевая :: /ХВС/Очистка","24-01-2017 00:00:00",null,"01-01-2017 00:00:00"]
[97,"Республика Башкортостан","Белорецкий муниципальный район","80611000","Верхнеавзянский сельский совет","80611415","30873301","ООО САНАТОРИЙ \"АССЫ\"","0256996711","025601001","Оказание услуг в сфере водоснабжения","Подвоз воды :: Техническая :: Питьевая :: Техническая :: Питьевая :: Питьевая :: Очистка","/ХВС/Подвоз воды :: /ХВС/Сбыт/Техническая :: /ХВС/Сбыт/Питьевая :: /ХВС/Транспортировка/Техническая :: /ХВС/Транспортировка/Питьевая :: /ХВС/Производство/Питьевая :: /ХВС/Очистка","24-01-2017 00:00:00",null,"01-01-2017 00:00:00"]
[98,"Республика Башкортостан","Белорецкий муниципальный район","80611000","Город Белорецк","80611101","26471915","МУП \"Водоканал\" (Белорецк)","0256018871","025601001","Оказание услуг в сфере водоснабжения","Техническая :: Питьевая :: Техническая :: Питьевая :: Техническая :: Питьевая","/ХВС/Сбыт/Техническая :: /ХВС/Сбыт/Питьевая :: /ХВС/Транспортировка/Техническая :: /ХВС/Транспортировка/Питьевая :: /ХВС/Производство/Техническая :: /ХВС/Производство/Питьевая",null,null,"15-01-2010 00:00:00"]
[99,"Республика Башкортостан","Белорецкий муниципальный район","80611000","Город Белорецк","80611101","26471915","МУП \"Водоканал\" (Белорецк)","0256018871","025601001","Транспортировка воды","Техническая :: Питьевая :: Техническая :: Питьевая :: Техническая :: Питьевая","/ХВС/Сбыт/Техническая :: /ХВС/Сбыт/Питьевая :: /ХВС/Транспортировка/Техническая :: /ХВС/Транспортировка/Питьевая :: /ХВС/Производство/Техническая :: /ХВС/Производство/Питьевая",null,null,"15-01-2010 00:00:00"]
[100,"Республика Башкортостан","Белорецкий муниципальный район","80611000","Город Белорецк","80611101","30873301","ООО САНАТОРИЙ \"АССЫ\"","0256996711","025601001","Оказание услуг в сфере водоснабжения","Подвоз воды :: Техническая :: Питьевая :: Техническая :: Питьевая :: Техническая :: Питьевая :: Очистка","/ХВС/Подвоз воды :: /ХВС/Сбыт/Техническая :: /ХВС/Сбыт/Питьевая :: /ХВС/Транспортировка/Техническая :: /ХВС/Транспортировка/Питьевая :: /ХВС/Производство/Техническая :: /ХВС/Производство/Питьевая :: /ХВС/Очистка","24-01-2017 00:00:00",null,"01-01-2017 00:00:00"]
[101,"Республика Башкортостан","Белорецкий муниципальный район","80611000","Железнодорожный сельский совет","80611418","26353670","МУП \"ЖКХ Железнодорожный\"","0256016835","025601001","Транспортировка воды","Техническая :: Питьевая :: Техническая :: Питьевая :: Техническая :: Питьевая","/ХВС/Сбыт/Техническая :: /ХВС/Сбыт/Питьевая :: /ХВС/Транспортировка/Техническая :: /ХВС/Транспортировка/Питьевая :: /ХВС/Производство/Техническая :: /ХВС/Производство/Питьевая",null,null,"15-09-2008 00:00:00"]
[102,"Республика Башкортостан","Белорецкий муниципальный район","80611000","Железнодорожный сельский совет","80611418","26353670","МУП \"ЖКХ Железнодорожный\"","0256016835","025601001","Оказание услуг в сфере водоснабжения","Техническая :: Питьевая :: Техническая :: Питьевая :: Техническая :: Питьевая","/ХВС/Сбыт/Техническая :: /ХВС/Сбыт/Питьевая :: /ХВС/Транспортировка/Техническая :: /ХВС/Транспортировка/Питьевая :: /ХВС/Производство/Техническая :: /ХВС/Производство/Питьевая",null,null,"15-09-2008 00:00:00"]
[103,"Республика Башкортостан","Белорецкий муниципальный район","80611000","Железнодорожный сельский совет","80611418","30873301","ООО САНАТОРИЙ \"АССЫ\"","0256996711","025601001","Оказание услуг в сфере водоснабжения","Подвоз воды :: Техническая :: Питьевая :: Техническая :: Питьевая :: Питьевая :: Очистка","/ХВС/Подвоз воды :: /ХВС/Сбыт/Техническая :: /ХВС/Сбыт/Питьевая :: /ХВС/Транспортировка/Техническая :: /ХВС/Транспортировка/Питьевая :: /ХВС/Производство/Питьевая :: /ХВС/Очистка","24-01-2017 00:00:00",null,"01-01-2017 00:00:00"]
[104,"Республика Башкортостан","Белорецкий муниципальный район","80611000","Зигазинский сельский совет","80611416","30873301","ООО САНАТОРИЙ \"АССЫ\"","0256996711","025601001","Оказание услуг в сфере водоснабжения","Подвоз воды :: Техническая :: Питьевая :: Техническая :: Питьевая :: Питьевая :: Очистка","/ХВС/Подвоз воды :: /ХВС/Сбыт/Техническая :: /ХВС/Сбыт/Питьевая :: /ХВС/Транспортировка/Техническая :: /ХВС/Транспортировка/Питьевая :: /ХВС/Производство/Питьевая :: /ХВС/Очистка","24-01-2017 00:00:00",null,"01-01-2017 00:00:00"]
[105,"Республика Башкортостан","Белорецкий муниципальный район","80611000","Зуяковский сельский совет","80611417","30873301","ООО САНАТОРИЙ \"АССЫ\"","0256996711","025601001","Оказание услуг в сфере водоснабжения","Подвоз воды :: Техническая :: Питьевая :: Техническая :: Питьевая :: Питьевая :: Очистка","/ХВС/Подвоз воды :: /ХВС/Сбыт/Техническая :: /ХВС/Сбыт/Питьевая :: /ХВС/Транспортировка/Техническая :: /ХВС/Транспортировка/Питьевая :: /ХВС/Производство/Питьевая :: /ХВС/Очистка","24-01-2017 00:00:00",null,"01-01-2017 00:00:00"]
[106,"Республика Башкортостан","Белорецкий муниципальный район","80611000","Инзерский сельский совет","80611420","26353620","МУП \"Инзерское ПУЖКХ\"","0211003931","025601001","Оказание услуг в сфере водоснабжения","Техническая :: Питьевая :: Техническая :: Питьевая :: Техническая :: Питьевая","/ХВС/Сбыт/Техническая :: /ХВС/Сбыт/Питьевая :: /ХВС/Транспортировка/Техническая :: /ХВС/Транспортировка/Питьевая :: /ХВС/Производство/Техническая :: /ХВС/Производство/Питьевая",null,null,"15-09-2008 00:00:00"]
[107,"Республика Башкортостан","Белорецкий муниципальный район","80611000","Инзерский сельский совет","80611420","26353620","МУП \"Инзерское ПУЖКХ\"","0211003931","025601001","Транспортировка воды","Техническая :: Питьевая :: Техническая :: Питьевая :: Техническая :: Питьевая","/ХВС/Сбыт/Техническая :: /ХВС/Сбыт/Питьевая :: /ХВС/Транспортировка/Техническая :: /ХВС/Транспортировка/Питьевая :: /ХВС/Производство/Техническая :: /ХВС/Производство/Питьевая",null,null,"15-09-2008 00:00:00"]
[108,"Республика Башкортостан","Белорецкий муниципальный район","80611000","Инзерский сельский совет","80611420","30873301","ООО САНАТОРИЙ \"АССЫ\"","0256996711","025601001","Оказание услуг в сфере водоснабжения","Подвоз воды :: Техническая :: Питьевая :: Техническая :: Питьевая :: Питьевая :: Очистка","/ХВС/Подвоз воды :: /ХВС/Сбыт/Техническая :: /ХВС/Сбыт/Питьевая :: /ХВС/Транспортировка/Техническая :: /ХВС/Транспортировка/Питьевая :: /ХВС/Производство/Питьевая :: /ХВС/Очистка","24-01-2017 00:00:00",null,"01-01-2017 00:00:00"]
[109,"Республика Башкортостан","Белорецкий муниципальный район","80611000","Ишлинский сельский совет","80611422","26812367","Куйбышевская дирекция  по тепловодоснабжению структурное подразделение Центральной дирекции по тепловодоснабжению филиала ПАО «РЖД»","7708503727","631145034","Оказание услуг в сфере водоснабжения","Питьевая :: Питьевая :: Питьевая","/ХВС/Сбыт/Питьевая :: /ХВС/Транспортировка/Питьевая :: /ХВС/Производство/Питьевая",null,null,"31-12-2017 00:00:00","31-12-2017 00:00:00"]
[110,"Республика Башкортостан","Белорецкий муниципальный район","80611000","Ишлинский сельский совет","80611422","26812367","Куйбышевская дирекция  по тепловодоснабжению структурное подразделение Центральной дирекции по тепловодоснабжению филиала ПАО «РЖД»","7708503727","631145034","Транспортировка воды","Питьевая :: Питьевая :: Питьевая","/ХВС/Сбыт/Питьевая :: /ХВС/Транспортировка/Питьевая :: /ХВС/Производство/Питьевая",null,null,"31-12-2017 00:00:00","31-12-2017 00:00:00"]
[111,"Республика Башкортостан","Белорецкий муниципальный район","80611000","Ишлинский сельский совет","80611422","26353670","МУП \"ЖКХ Железнодорожный\"","0256016835","025601001","Оказание услуг в сфере водоснабжения","Питьевая :: Питьевая :: Питьевая","/ХВС/Сбыт/Питьевая :: /ХВС/Транспортировка/Питьевая :: /ХВС/Производство/Питьевая",null,null,"28-07-2016 00:00:00"]
[112,"Республика Башкортостан","Белорецкий муниципальный район","80611000","Ишлинский сельский совет","80611422","26353670","МУП \"ЖКХ Железнодорожный\"","0256016835","025601001","Транспортировка воды","Питьевая :: Питьевая :: Питьевая","/ХВС/Сбыт/Питьевая :: /ХВС/Транспортировка/Питьевая :: /ХВС/Производство/Питьевая",null,null,"28-07-2016 00:00:00"]
[113,"Республика Башкортостан","Белорецкий муниципальный район","80611000","Ишлинский сельский совет","80611422","30873301","ООО САНАТОРИЙ \"АССЫ\"","0256996711","025601001","Оказание услуг в сфере водоснабжения","Подвоз воды :: Техническая :: Питьевая :: Техническая :: Питьевая :: Питьевая :: Очистка","/ХВС/Подвоз воды :: /ХВС/Сбыт/Техническая :: /ХВС/Сбыт/Питьевая :: /ХВС/Транспортировка/Техническая :: /ХВС/Транспортировка/Питьевая :: /ХВС/Производство/Питьевая :: /ХВС/Очистка","24-01-2017 00:00:00",null,"01-01-2017 00:00:00"]
[114,"Республика Башкортостан","Белорецкий муниципальный район","80611000","Кагинский сельский совет","80611425","30873301","ООО САНАТОРИЙ \"АССЫ\"","0256996711","025601001","Оказание услуг в сфере водоснабжения","Подвоз воды :: Техническая :: Питьевая :: Техническая :: Питьевая :: Питьевая :: Очистка","/ХВС/Подвоз воды :: /ХВС/Сбыт/Техническая :: /ХВС/Сбыт/Питьевая :: /ХВС/Транспортировка/Техническая :: /ХВС/Транспортировка/Питьевая :: /ХВС/Производство/Питьевая :: /ХВС/Очистка","24-01-2017 00:00:00",null,"01-01-2017 00:00:00"]
[115,"Республика Башкортостан","Белорецкий муниципальный район","80611000","Ломовский сельский совет","80611427","26353670","МУП \"ЖКХ Железнодорожный\"","0256016835","025601001","Транспортировка воды","Питьевая :: Питьевая :: Питьевая","/ХВС/Сбыт/Питьевая :: /ХВС/Транспортировка/Питьевая :: /ХВС/Производство/Питьевая",null,null,"28-07-2016 00:00:00"]
[116,"Республика Башкортостан","Белорецкий муниципальный район","80611000","Ломовский сельский совет","80611427","26353670","МУП \"ЖКХ Железнодорожный\"","0256016835","025601001","Оказание услуг в сфере водоснабжения","Питьевая :: Питьевая :: Питьевая","/ХВС/Сбыт/Питьевая :: /ХВС/Транспортировка/Питьевая :: /ХВС/Производство/Питьевая",null,null,"28-07-2016 00:00:00"]
[117,"Республика Башкортостан","Белорецкий муниципальный район","80611000","Ломовский сельский совет","80611427","30873301","ООО САНАТОРИЙ \"АССЫ\"","0256996711","025601001","Оказание услуг в сфере водоснабжения","Подвоз воды :: Техническая :: Питьевая :: Техническая :: Питьевая :: Питьевая :: Очистка","/ХВС/Подвоз воды :: /ХВС/Сбыт/Техническая :: /ХВС/Сбыт/Питьевая :: /ХВС/Транспортировка/Техническая :: /ХВС/Транспортировка/Питьевая :: /ХВС/Производство/Питьевая :: /ХВС/Очистка","24-01-2017 00:00:00",null,"01-01-2017 00:00:00"]
[118,"Республика Башкортостан","Белорецкий муниципальный район","80611000","Николаевский сельский совет","80611434","30873301","ООО САНАТОРИЙ \"АССЫ\"","0256996711","025601001","Оказание услуг в сфере водоснабжения","Подвоз воды :: Техническая :: Питьевая :: Техническая :: Питьевая :: Питьевая :: Очистка","/ХВС/Подвоз воды :: /ХВС/Сбыт/Техническая :: /ХВС/Сбыт/Питьевая :: /ХВС/Транспортировка/Техническая :: /ХВС/Транспортировка/Питьевая :: /ХВС/Производство/Питьевая :: /ХВС/Очистка","24-01-2017 00:00:00",null,"01-01-2017 00:00:00"]
[119,"Республика Башкортостан","Белорецкий муниципальный район","80611000","Нурский сельский совет","80611440","30873301","ООО САНАТОРИЙ \"АССЫ\"","0256996711","025601001","Оказание услуг в сфере водоснабжения","Подвоз воды :: Техническая :: Питьевая :: Техническая :: Питьевая :: Питьевая :: Очистка","/ХВС/Подвоз воды :: /ХВС/Сбыт/Техническая :: /ХВС/Сбыт/Питьевая :: /ХВС/Транспортировка/Техническая :: /ХВС/Транспортировка/Питьевая :: /ХВС/Производство/Питьевая :: /ХВС/Очистка","24-01-2017 00:00:00",null,"01-01-2017 00:00:00"]
[120,"Республика Башкортостан","Белорецкий муниципальный район","80611000","Серменевский сельский совет","80611443","30873301","ООО САНАТОРИЙ \"АССЫ\"","0256996711","025601001","Оказание услуг в сфере водоснабжения","Подвоз воды :: Техническая :: Питьевая :: Техническая :: Питьевая :: Питьевая :: Очистка","/ХВС/Подвоз воды :: /ХВС/Сбыт/Техническая :: /ХВС/Сбыт/Питьевая :: /ХВС/Транспортировка/Техническая :: /ХВС/Транспортировка/Питьевая :: /ХВС/Производство/Питьевая :: /ХВС/Очистка","24-01-2017 00:00:00",null,"01-01-2017 00:00:00"]
[121,"Республика Башкортостан","Белорецкий муниципальный район","80611000","Сосновский сельский совет","80611446","30873301","ООО САНАТОРИЙ \"АССЫ\"","0256996711","025601001","Оказание услуг в сфере водоснабжения","Подвоз воды :: Техническая :: Питьевая :: Техническая :: Питьевая :: Питьевая :: Очистка","/ХВС/Подвоз воды :: /ХВС/Сбыт/Техническая :: /ХВС/Сбыт/Питьевая :: /ХВС/Транспортировка/Техническая :: /ХВС/Транспортировка/Питьевая :: /ХВС/Производство/Питьевая :: /ХВС/Очистка","24-01-2017 00:00:00",null,"01-01-2017 00:00:00"]
[122,"Республика Башкортостан","Белорецкий муниципальный район","80611000","Тирлянский сельский совет","80611448","30873301","ООО САНАТОРИЙ \"АССЫ\"","0256996711","025601001","Оказание услуг в сфере водоснабжения","Подвоз воды :: Техническая :: Питьевая :: Техническая :: Питьевая :: Питьевая :: Очистка","/ХВС/Подвоз воды :: /ХВС/Сбыт/Техническая :: /ХВС/Сбыт/Питьевая :: /ХВС/Транспортировка/Техническая :: /ХВС/Транспортировка/Питьевая :: /ХВС/Производство/Питьевая :: /ХВС/Очистка","24-01-2017 00:00:00",null,"01-01-2017 00:00:00"]
[123,"Республика Башкортостан","Белорецкий муниципальный район","80611000","Туканский сельский совет","80611449","30873301","ООО САНАТОРИЙ \"АССЫ\"","0256996711","025601001","Оказание услуг в сфере водоснабжения","Подвоз воды :: Техническая :: Питьевая :: Техническая :: Питьевая :: Питьевая :: Очистка","/ХВС/Подвоз воды :: /ХВС/Сбыт/Техническая :: /ХВС/Сбыт/Питьевая :: /ХВС/Транспортировка/Техническая :: /ХВС/Транспортировка/Питьевая :: /ХВС/Производство/Питьевая :: /ХВС/Очистка","24-01-2017 00:00:00",null,"01-01-2017 00:00:00"]
[124,"Республика Башкортостан","Белорецкий муниципальный район","80611000","Туканский сельский совет","80611449","28487302","ООО УК \"Тукан\"","0256023511","027802001","Оказание услуг в сфере водоснабжения","Подвоз воды :: Техническая :: Питьевая :: Техническая :: Питьевая :: Техническая :: Питьевая :: Очистка","/ХВС/Подвоз воды :: /ХВС/Сбыт/Техническая :: /ХВС/Сбыт/Питьевая :: /ХВС/Транспортировка/Техническая :: /ХВС/Транспортировка/Питьевая :: /ХВС/Производство/Техническая :: /ХВС/Производство/Питьевая :: /ХВС/Очистка","25-02-2014 00:00:00",null,"25-02-2014 00:00:00"]
[125,"Республика Башкортостан","Белорецкий муниципальный район","80611000","Узянский сельский совет","80611452","30873301","ООО САНАТОРИЙ \"АССЫ\"","0256996711","025601001","Оказание услуг в сфере водоснабжения","Подвоз воды :: Техническая :: Питьевая :: Техническая :: Питьевая :: Питьевая :: Очистка","/ХВС/Подвоз воды :: /ХВС/Сбыт/Техническая :: /ХВС/Сбыт/Питьевая :: /ХВС/Транспортировка/Техническая :: /ХВС/Транспортировка/Питьевая :: /ХВС/Производство/Питьевая :: /ХВС/Очистка","24-01-2017 00:00:00",null,"01-01-2017 00:00:00"]
[126,"Республика Башкортостан","Белорецкий муниципальный район","80611000","Шигаевский сельский совет","80611455","30873301","ООО САНАТОРИЙ \"АССЫ\"","0256996711","025601001","Оказание услуг в сфере водоснабжения","Подвоз воды :: Техническая :: Питьевая :: Техническая :: Питьевая :: Питьевая :: Очистка","/ХВС/Подвоз воды :: /ХВС/Сбыт/Техническая :: /ХВС/Сбыт/Питьевая :: /ХВС/Транспортировка/Техническая :: /ХВС/Транспортировка/Питьевая :: /ХВС/Производство/Питьевая :: /ХВС/Очистка","24-01-2017 00:00:00",null,"01-01-2017 00:00:00"]
[127,"Республика Башкортостан","Бижбулякский муниципальный район","80612000","Бижбулякский сельский совет","80612410","26353621","МУП \"Тепловик\" Бижбулякского района","0212004984","021201001","Оказание услуг в сфере водоснабжения","Подвоз воды :: Техническая :: Питьевая :: Техническая :: Питьевая :: Техническая :: Питьевая :: Очистка","/ХВС/Подвоз воды :: /ХВС/Сбыт/Техническая :: /ХВС/Сбыт/Питьевая :: /ХВС/Транспортировка/Техническая :: /ХВС/Транспортировка/Питьевая :: /ХВС/Производство/Техническая :: /ХВС/Производство/Питьевая :: /ХВС/Очистка",null,null,"15-09-2008 00:00:00"]
[128,"Республика Башкортостан","Бижбулякский муниципальный район","80612000","Бижбулякский сельский совет","80612410","26799678","ООО \"Бижбулякводоканалсервис\"","0212006460","021201001","Оказание услуг в сфере водоснабжения","Подвоз воды :: Техническая :: Питьевая :: Техническая :: Питьевая :: Техническая :: Питьевая :: Очистка","/ХВС/Подвоз воды :: /ХВС/Сбыт/Техническая :: /ХВС/Сбыт/Питьевая :: /ХВС/Транспортировка/Техническая :: /ХВС/Транспортировка/Питьевая :: /ХВС/Производство/Техническая :: /ХВС/Производство/Питьевая :: /ХВС/Очистка",null,null,"28-03-2011 00:00:00"]
[129,"Республика Башкортостан","Бижбулякский муниципальный район","80612000","Сухореченский сельский совет","80612443","26841421","Туймазинское нефтепроводное управление - филиал АО \"Транснефть-Урал\"","0278039018","026902001","Оказание услуг в сфере водоснабжения","Питьевая :: Питьевая :: Питьевая :: Очистка","/ХВС/Сбыт/Питьевая :: /ХВС/Транспортировка/Питьевая :: /ХВС/Производство/Питьевая :: /ХВС/Очистка",null,null,"10-08-2017 00:00:00"]
[130,"Республика Башкортостан","Бижбулякский муниципальный район","80612000","Сухореченский сельский совет","80612443","26841421","Туймазинское нефтепроводное управление - филиал АО \"Транснефть-Урал\"","0278039018","026902001","Транспортировка воды","Питьевая :: Питьевая :: Питьевая :: Очистка","/ХВС/Сбыт/Питьевая :: /ХВС/Транспортировка/Питьевая :: /ХВС/Производство/Питьевая :: /ХВС/Очистка",null,null,"10-08-2017 00:00:00"]
[131,"Республика Башкортостан","Бирский муниципальный район","80613000","Город Бирск","80613101","30990030","АО «Башкоммунводоканал»","0278181938","027801001","Оказание услуг в сфере водоснабжения","Подвоз воды :: Техническая :: Техническая","/ХВС/Подвоз воды :: /ХВС/Сбыт/Техническая :: /ХВС/Транспортировка/Техническая",null,null,"14-11-2017 00:00:00","21-02-2018 00:00:00"]
[132,"Республика Башкортостан","Бирский муниципальный район","80613000","Город Бирск","80613101","30990030","АО «Башкоммунводоканал»","0278181938","027801001","Транспортировка воды","Подвоз воды :: Техническая :: Техническая","/ХВС/Подвоз воды :: /ХВС/Сбыт/Техническая :: /ХВС/Транспортировка/Техническая",null,null,"14-11-2017 00:00:00","21-02-2018 00:00:00"]
[133,"Республика Башкортостан","Бирский муниципальный район","80613000","Город Бирск","80613101","30990030","АО «Башкоммунводоканал»","0278181938","027801001","Оказание услуг в сфере водоснабжения","Питьевая :: Питьевая :: Техническая :: Питьевая :: Очистка","/ХВС/Сбыт/Питьевая :: /ХВС/Транспортировка/Питьевая :: /ХВС/Производство/Техническая :: /ХВС/Производство/Питьевая :: /ХВС/Очистка",null,null,"14-11-2017 00:00:00"]
[134,"Республика Башкортостан","Бирский муниципальный район","80613000","Город Бирск","80613101","30990030","АО «Башкоммунводоканал»","0278181938","027801001","Транспортировка воды","Питьевая :: Питьевая :: Техническая :: Питьевая :: Очистка","/ХВС/Сбыт/Питьевая :: /ХВС/Транспортировка/Питьевая :: /ХВС/Производство/Техническая :: /ХВС/Производство/Питьевая :: /ХВС/Очистка",null,null,"14-11-2017 00:00:00"]
[135,"Республика Башкортостан","Бирский муниципальный район","80613000","Город Бирск","80613101","26471929","ООО \"Водоканалстройсервис\" Бирский МР","0257008058","025701001","Оказание услуг в сфере водоснабжения","Подвоз воды :: Техническая :: Питьевая :: Техническая :: Питьевая :: Техническая :: Питьевая :: Очистка","/ХВС/Подвоз воды :: /ХВС/Сбыт/Техническая :: /ХВС/Сбыт/Питьевая :: /ХВС/Транспортировка/Техническая :: /ХВС/Транспортировка/Питьевая :: /ХВС/Производство/Техническая :: /ХВС/Производство/Питьевая :: /ХВС/Очистка",null,"01-11-2017 00:00:00","15-01-2010 00:00:00","01-11-2017 00:00:00"]
[136,"Республика Башкортостан","Благоварский муниципальный район","80614000","Каргалинский сельский совет","80614416","26812367","Куйбышевская дирекция  по тепловодоснабжению структурное подразделение Центральной дирекции по тепловодоснабжению филиала ПАО «РЖД»","7708503727","631145034","Транспортировка воды","Питьевая :: Питьевая :: Питьевая","/ХВС/Сбыт/Питьевая :: /ХВС/Транспортировка/Питьевая :: /ХВС/Производство/Питьевая",null,null,"31-12-2017 00:00:00","31-12-2017 00:00:00"]
[137,"Республика Башкортостан","Благоварский муниципальный район","80614000","Каргалинский сельский совет","80614416","26812367","Куйбышевская дирекция  по тепловодоснабжению структурное подразделение Центральной дирекции по тепловодоснабжению филиала ПАО «РЖД»","7708503727","631145034","Оказание услуг в сфере водоснабжения","Питьевая :: Питьевая :: Питьевая","/ХВС/Сбыт/Питьевая :: /ХВС/Транспортировка/Питьевая :: /ХВС/Производство/Питьевая",null,null,"31-12-2017 00:00:00","31-12-2017 00:00:00"]
[138,"Республика Башкортостан","Благоварский муниципальный район","80614000","Языковский сельский совет","80614437","26471937","ООО \"Водхоз\" Благоварский район","0214005052","021401001","Оказание услуг в сфере водоснабжения","Техническая :: Питьевая :: Техническая :: Питьевая :: Техническая :: Питьевая","/ХВС/Сбыт/Техническая :: /ХВС/Сбыт/Питьевая :: /ХВС/Транспортировка/Техническая :: /ХВС/Транспортировка/Питьевая :: /ХВС/Производство/Техническая :: /ХВС/Производство/Питьевая","01-08-2017 00:00:00",null,"15-01-2010 00:00:00"]
[139,"Республика Башкортостан","Благоварский муниципальный район","80614000","Языковский сельский совет","80614437","26471937","ООО \"Водхоз\" Благоварский район","0214005052","021401001","Транспортировка воды","Техническая :: Питьевая :: Техническая :: Питьевая :: Техническая :: Питьевая","/ХВС/Сбыт/Техническая :: /ХВС/Сбыт/Питьевая :: /ХВС/Транспортировка/Техническая :: /ХВС/Транспортировка/Питьевая :: /ХВС/Производство/Техническая :: /ХВС/Производство/Питьевая","01-08-2017 00:00:00",null,"15-01-2010 00:00:00"]
[140,"Республика Башкортостан","Благовещенский муниципальный район","80615000","Бедеево-Полянский сельский совет","80615404","30385343","Приуфимская ТЭЦ - филиал ООО \"Башкирская генерирующая компания\"","0277077282","027701001","Транспортировка воды","Техническая :: Техническая :: Техническая","/ХВС/Сбыт/Техническая :: /ХВС/Транспортировка/Техническая :: /ХВС/Производство/Техническая","28-12-2015 00:00:00",null,"08-07-2016 00:00:00"]
[141,"Республика Башкортостан","Благовещенский муниципальный район","80615000","Бедеево-Полянский сельский совет","80615404","30385343","Приуфимская ТЭЦ - филиал ООО \"Башкирская генерирующая компания\"","0277077282","027701001","Оказание услуг в сфере водоснабжения","Техническая :: Техническая :: Техническая","/ХВС/Сбыт/Техническая :: /ХВС/Транспортировка/Техническая :: /ХВС/Производство/Техническая","28-12-2015 00:00:00",null,"08-07-2016 00:00:00"]
[142,"Республика Башкортостан","Благовещенский муниципальный район","80615000","Богородский сельский совет","80615407","30385343","Приуфимская ТЭЦ - филиал ООО \"Башкирская генерирующая компания\"","0277077282","027701001","Транспортировка воды","Техническая :: Техническая :: Техническая","/ХВС/Сбыт/Техническая :: /ХВС/Транспортировка/Техническая :: /ХВС/Производство/Техническая","28-12-2015 00:00:00",null,"08-07-2016 00:00:00"]
[143,"Республика Башкортостан","Благовещенский муниципальный район","80615000","Богородский сельский совет","80615407","30385343","Приуфимская ТЭЦ - филиал ООО \"Башкирская генерирующая компания\"","0277077282","027701001","Оказание услуг в сфере водоснабжения","Техническая :: Техническая :: Техническая","/ХВС/Сбыт/Техническая :: /ХВС/Транспортировка/Техническая :: /ХВС/Производство/Техническая","28-12-2015 00:00:00",null,"08-07-2016 00:00:00"]
[144,"Республика Башкортостан","Благовещенский муниципальный район","80615000","Волковский сельский совет","80615413","30385343","Приуфимская ТЭЦ - филиал ООО \"Башкирская генерирующая компания\"","0277077282","027701001","Оказание услуг в сфере водоснабжения","Техническая :: Техническая :: Техническая","/ХВС/Сбыт/Техническая :: /ХВС/Транспортировка/Техническая :: /ХВС/Производство/Техническая","28-12-2015 00:00:00",null,"08-07-2016 00:00:00"]
[145,"Республика Башкортостан","Благовещенский муниципальный район","80615000","Волковский сельский совет","80615413","30385343","Приуфимская ТЭЦ - филиал ООО \"Башкирская генерирующая компания\"","0277077282","027701001","Транспортировка воды","Техническая :: Техническая :: Техническая","/ХВС/Сбыт/Техническая :: /ХВС/Транспортировка/Техническая :: /ХВС/Производство/Техническая","28-12-2015 00:00:00",null,"08-07-2016 00:00:00"]
[146,"Республика Башкортостан","Благовещенский муниципальный район","80615000","Город Благовещенск","80615101","26471939","МУП \"Водоканал\"","0258011092","025801001","Оказание услуг в сфере водоснабжения","Подвоз воды :: Техническая :: Питьевая :: Техническая :: Питьевая :: Техническая :: Питьевая :: Очистка","/ХВС/Подвоз воды :: /ХВС/Сбыт/Техническая :: /ХВС/Сбыт/Питьевая :: /ХВС/Транспортировка/Техническая :: /ХВС/Транспортировка/Питьевая :: /ХВС/Производство/Техническая :: /ХВС/Производство/Питьевая :: /ХВС/Очистка",null,null,"15-01-2010 00:00:00"]
[147,"Республика Башкортостан","Благовещенский муниципальный район","80615000","Город Благовещенск","80615101","30385343","Приуфимская ТЭЦ - филиал ООО \"Башкирская генерирующая компания\"","0277077282","027701001","Оказание услуг в сфере водоснабжения","Техническая :: Техническая :: Техническая","/ХВС/Сбыт/Техническая :: /ХВС/Транспортировка/Техническая :: /ХВС/Производство/Техническая","28-12-2015 00:00:00",null,"08-07-2016 00:00:00"]
[148,"Республика Башкортостан","Благовещенский муниципальный район","80615000","Город Благовещенск","80615101","30385343","Приуфимская ТЭЦ - филиал ООО \"Башкирская генерирующая компания\"","0277077282","027701001","Транспортировка воды","Техническая :: Техническая :: Техническая","/ХВС/Сбыт/Техническая :: /ХВС/Транспортировка/Техническая :: /ХВС/Производство/Техническая","28-12-2015 00:00:00",null,"08-07-2016 00:00:00"]
[149,"Республика Башкортостан","Благовещенский муниципальный район","80615000","Изяковский сельский совет","80615419","30385343","Приуфимская ТЭЦ - филиал ООО \"Башкирская генерирующая компания\"","0277077282","027701001","Оказание услуг в сфере водоснабжения","Техническая :: Техническая :: Техническая","/ХВС/Сбыт/Техническая :: /ХВС/Транспортировка/Техническая :: /ХВС/Производство/Техническая","28-12-2015 00:00:00",null,"08-07-2016 00:00:00"]
[150,"Республика Башкортостан","Благовещенский муниципальный район","80615000","Изяковский сельский совет","80615419","30385343","Приуфимская ТЭЦ - филиал ООО \"Башкирская генерирующая компания\"","0277077282","027701001","Транспортировка воды","Техническая :: Техническая :: Техническая","/ХВС/Сбыт/Техническая :: /ХВС/Транспортировка/Техническая :: /ХВС/Производство/Техническая","28-12-2015 00:00:00",null,"08-07-2016 00:00:00"]
[151,"Республика Башкортостан","Благовещенский муниципальный район","80615000","Иликовский сельский совет","80615422","30385343","Приуфимская ТЭЦ - филиал ООО \"Башкирская генерирующая компания\"","0277077282","027701001","Транспортировка воды","Техническая :: Техническая :: Техническая","/ХВС/Сбыт/Техническая :: /ХВС/Транспортировка/Техническая :: /ХВС/Производство/Техническая","28-12-2015 00:00:00",null,"08-07-2016 00:00:00"]
[152,"Республика Башкортостан","Благовещенский муниципальный район","80615000","Иликовский сельский совет","80615422","30385343","Приуфимская ТЭЦ - филиал ООО \"Башкирская генерирующая компания\"","0277077282","027701001","Оказание услуг в сфере водоснабжения","Техническая :: Техническая :: Техническая","/ХВС/Сбыт/Техническая :: /ХВС/Транспортировка/Техническая :: /ХВС/Производство/Техническая","28-12-2015 00:00:00",null,"08-07-2016 00:00:00"]
[153,"Республика Башкортостан","Благовещенский муниципальный район","80615000","Ильино-Полянский сельский совет","80615425","30352952","Общество с ограниченной ответственностью «Тепловик» Благовещенский район","0258950293","025801001","Оказание услуг в сфере водоснабжения","Питьевая :: Питьевая","/ХВС/Сбыт/Питьевая :: /ХВС/Производство/Питьевая",null,null,"20-10-2015 00:00:00"]
[154,"Республика Башкортостан","Благовещенский муниципальный район","80615000","Ильино-Полянский сельский совет","80615425","30385343","Приуфимская ТЭЦ - филиал ООО \"Башкирская генерирующая компания\"","0277077282","027701001","Оказание услуг в сфере водоснабжения","Техническая :: Техническая :: Техническая","/ХВС/Сбыт/Техническая :: /ХВС/Транспортировка/Техническая :: /ХВС/Производство/Техническая","28-12-2015 00:00:00",null,"08-07-2016 00:00:00"]
[155,"Республика Башкортостан","Благовещенский муниципальный район","80615000","Ильино-Полянский сельский совет","80615425","30385343","Приуфимская ТЭЦ - филиал ООО \"Башкирская генерирующая компания\"","0277077282","027701001","Транспортировка воды","Техническая :: Техническая :: Техническая","/ХВС/Сбыт/Техническая :: /ХВС/Транспортировка/Техническая :: /ХВС/Производство/Техническая","28-12-2015 00:00:00",null,"08-07-2016 00:00:00"]
[156,"Республика Башкортостан","Благовещенский муниципальный район","80615000","Николаевский сельский совет","80615428","30385343","Приуфимская ТЭЦ - филиал ООО \"Башкирская генерирующая компания\"","0277077282","027701001","Транспортировка воды","Техническая :: Техническая :: Техническая","/ХВС/Сбыт/Техническая :: /ХВС/Транспортировка/Техническая :: /ХВС/Производство/Техническая","28-12-2015 00:00:00",null,"08-07-2016 00:00:00"]
[157,"Республика Башкортостан","Благовещенский муниципальный район","80615000","Николаевский сельский совет","80615428","30385343","Приуфимская ТЭЦ - филиал ООО \"Башкирская генерирующая компания\"","0277077282","027701001","Оказание услуг в сфере водоснабжения","Техническая :: Техническая :: Техническая","/ХВС/Сбыт/Техническая :: /ХВС/Транспортировка/Техническая :: /ХВС/Производство/Техническая","28-12-2015 00:00:00",null,"08-07-2016 00:00:00"]
[158,"Республика Башкортостан","Благовещенский муниципальный район","80615000","Новонадеждинский сельский совет","80615431","30385343","Приуфимская ТЭЦ - филиал ООО \"Башкирская генерирующая компания\"","0277077282","027701001","Оказание услуг в сфере водоснабжения","Техническая :: Техническая :: Техническая","/ХВС/Сбыт/Техническая :: /ХВС/Транспортировка/Техническая :: /ХВС/Производство/Техническая","28-12-2015 00:00:00",null,"08-07-2016 00:00:00"]
[159,"Республика Башкортостан","Благовещенский муниципальный район","80615000","Новонадеждинский сельский совет","80615431","30385343","Приуфимская ТЭЦ - филиал ООО \"Башкирская генерирующая компания\"","0277077282","027701001","Транспортировка воды","Техническая :: Техническая :: Техническая","/ХВС/Сбыт/Техническая :: /ХВС/Транспортировка/Техническая :: /ХВС/Производство/Техническая","28-12-2015 00:00:00",null,"08-07-2016 00:00:00"]
[160,"Республика Башкортостан","Благовещенский муниципальный район","80615000","Октябрьский сельский совет","80615434","30385343","Приуфимская ТЭЦ - филиал ООО \"Башкирская генерирующая компания\"","0277077282","027701001","Оказание услуг в сфере водоснабжения","Техническая :: Техническая :: Техническая","/ХВС/Сбыт/Техническая :: /ХВС/Транспортировка/Техническая :: /ХВС/Производство/Техническая","28-12-2015 00:00:00",null,"08-07-2016 00:00:00"]
[161,"Республика Башкортостан","Благовещенский муниципальный район","80615000","Октябрьский сельский совет","80615434","30385343","Приуфимская ТЭЦ - филиал ООО \"Башкирская генерирующая компания\"","0277077282","027701001","Транспортировка воды","Техническая :: Техническая :: Техническая","/ХВС/Сбыт/Техническая :: /ХВС/Транспортировка/Техническая :: /ХВС/Производство/Техническая","28-12-2015 00:00:00",null,"08-07-2016 00:00:00"]
[162,"Республика Башкортостан","Благовещенский муниципальный район","80615000","Орловский сельский совет","80615437","30385343","Приуфимская ТЭЦ - филиал ООО \"Башкирская генерирующая компания\"","0277077282","027701001","Транспортировка воды","Техническая :: Техническая :: Техническая","/ХВС/Сбыт/Техническая :: /ХВС/Транспортировка/Техническая :: /ХВС/Производство/Техническая","28-12-2015 00:00:00",null,"08-07-2016 00:00:00"]
[163,"Республика Башкортостан","Благовещенский муниципальный район","80615000","Орловский сельский совет","80615437","30385343","Приуфимская ТЭЦ - филиал ООО \"Башкирская генерирующая компания\"","0277077282","027701001","Оказание услуг в сфере водоснабжения","Техническая :: Техническая :: Техническая","/ХВС/Сбыт/Техническая :: /ХВС/Транспортировка/Техническая :: /ХВС/Производство/Техническая","28-12-2015 00:00:00",null,"08-07-2016 00:00:00"]
[164,"Республика Башкортостан","Благовещенский муниципальный район","80615000","Покровский сельский совет","80615440","30385343","Приуфимская ТЭЦ - филиал ООО \"Башкирская генерирующая компания\"","0277077282","027701001","Оказание услуг в сфере водоснабжения","Техническая :: Техническая :: Техническая","/ХВС/Сбыт/Техническая :: /ХВС/Транспортировка/Техническая :: /ХВС/Производство/Техническая","28-12-2015 00:00:00",null,"08-07-2016 00:00:00"]
[165,"Республика Башкортостан","Благовещенский муниципальный район","80615000","Покровский сельский совет","80615440","30385343","Приуфимская ТЭЦ - филиал ООО \"Башкирская генерирующая компания\"","0277077282","027701001","Транспортировка воды","Техническая :: Техническая :: Техническая","/ХВС/Сбыт/Техническая :: /ХВС/Транспортировка/Техническая :: /ХВС/Производство/Техническая","28-12-2015 00:00:00",null,"08-07-2016 00:00:00"]
[166,"Республика Башкортостан","Благовещенский муниципальный район","80615000","Саннинский сельский совет","80615443","30385343","Приуфимская ТЭЦ - филиал ООО \"Башкирская генерирующая компания\"","0277077282","027701001","Транспортировка воды","Техническая :: Техническая :: Техническая","/ХВС/Сбыт/Техническая :: /ХВС/Транспортировка/Техническая :: /ХВС/Производство/Техническая","28-12-2015 00:00:00",null,"08-07-2016 00:00:00"]
[167,"Республика Башкортостан","Благовещенский муниципальный район","80615000","Саннинский сельский совет","80615443","30385343","Приуфимская ТЭЦ - филиал ООО \"Башкирская генерирующая компания\"","0277077282","027701001","Оказание услуг в сфере водоснабжения","Техническая :: Техническая :: Техническая","/ХВС/Сбыт/Техническая :: /ХВС/Транспортировка/Техническая :: /ХВС/Производство/Техническая","28-12-2015 00:00:00",null,"08-07-2016 00:00:00"]
[168,"Республика Башкортостан","Благовещенский муниципальный район","80615000","Старонадеждинский сельский совет","80615449","30385343","Приуфимская ТЭЦ - филиал ООО \"Башкирская генерирующая компания\"","0277077282","027701001","Оказание услуг в сфере водоснабжения","Техническая :: Техническая :: Техническая","/ХВС/Сбыт/Техническая :: /ХВС/Транспортировка/Техническая :: /ХВС/Производство/Техническая","28-12-2015 00:00:00",null,"08-07-2016 00:00:00"]
[169,"Республика Башкортостан","Благовещенский муниципальный район","80615000","Старонадеждинский сельский совет","80615449","30385343","Приуфимская ТЭЦ - филиал ООО \"Башкирская генерирующая компания\"","0277077282","027701001","Транспортировка воды","Техническая :: Техническая :: Техническая","/ХВС/Сбыт/Техническая :: /ХВС/Транспортировка/Техническая :: /ХВС/Производство/Техническая","28-12-2015 00:00:00",null,"08-07-2016 00:00:00"]
[170,"Республика Башкортостан","Благовещенский муниципальный район","80615000","Тугайский сельский совет","80615453","30385343","Приуфимская ТЭЦ - филиал ООО \"Башкирская генерирующая компания\"","0277077282","027701001","Оказание услуг в сфере водоснабжения","Техническая :: Техническая :: Техническая","/ХВС/Сбыт/Техническая :: /ХВС/Транспортировка/Техническая :: /ХВС/Производство/Техническая","28-12-2015 00:00:00",null,"08-07-2016 00:00:00"]
[171,"Республика Башкортостан","Благовещенский муниципальный район","80615000","Тугайский сельский совет","80615453","30385343","Приуфимская ТЭЦ - филиал ООО \"Башкирская генерирующая компания\"","0277077282","027701001","Транспортировка воды","Техническая :: Техническая :: Техническая","/ХВС/Сбыт/Техническая :: /ХВС/Транспортировка/Техническая :: /ХВС/Производство/Техническая","28-12-2015 00:00:00",null,"08-07-2016 00:00:00"]
[172,"Республика Башкортостан","Благовещенский муниципальный район","80615000","Удельно-Дуванейский сельский совет","80615461","30385343","Приуфимская ТЭЦ - филиал ООО \"Башкирская генерирующая компания\"","0277077282","027701001","Транспортировка воды","Техническая :: Техническая :: Техническая","/ХВС/Сбыт/Техническая :: /ХВС/Транспортировка/Техническая :: /ХВС/Производство/Техническая","28-12-2015 00:00:00",null,"08-07-2016 00:00:00"]
[173,"Республика Башкортостан","Благовещенский муниципальный район","80615000","Удельно-Дуванейский сельский совет","80615461","30385343","Приуфимская ТЭЦ - филиал ООО \"Башкирская генерирующая компания\"","0277077282","027701001","Оказание услуг в сфере водоснабжения","Техническая :: Техническая :: Техническая","/ХВС/Сбыт/Техническая :: /ХВС/Транспортировка/Техническая :: /ХВС/Производство/Техническая","28-12-2015 00:00:00",null,"08-07-2016 00:00:00"]
[174,"Республика Башкортостан","Буздякский муниципальный район","80617000","Буздякский сельский совет","80617407","28976576","МУП \"БУЗДЯКСКИЙ КОМСЕРВИС\"","0216007320","021601001","Оказание услуг в сфере водоснабжения","Подвоз воды :: Техническая :: Питьевая :: Техническая :: Питьевая :: Техническая :: Питьевая :: Очистка","/ХВС/Подвоз воды :: /ХВС/Сбыт/Техническая :: /ХВС/Сбыт/Питьевая :: /ХВС/Транспортировка/Техническая :: /ХВС/Транспортировка/Питьевая :: /ХВС/Производство/Техническая :: /ХВС/Производство/Питьевая :: /ХВС/Очистка","05-06-2015 00:00:00",null,"05-06-2015 00:00:00"]
[175,"Республика Башкортостан","Буздякский муниципальный район","80617000","Гафурийский сельский совет","80617410","26812367","Куйбышевская дирекция  по тепловодоснабжению структурное подразделение Центральной дирекции по тепловодоснабжению филиала ПАО «РЖД»","7708503727","631145034","Оказание услуг в сфере водоснабжения","Питьевая :: Питьевая :: Питьевая","/ХВС/Сбыт/Питьевая :: /ХВС/Транспортировка/Питьевая :: /ХВС/Производство/Питьевая",null,null,"31-12-2017 00:00:00","31-12-2017 00:00:00"]
[176,"Республика Башкортостан","Буздякский муниципальный район","80617000","Гафурийский сельский совет","80617410","26812367","Куйбышевская дирекция  по тепловодоснабжению структурное подразделение Центральной дирекции по тепловодоснабжению филиала ПАО «РЖД»","7708503727","631145034","Транспортировка воды","Питьевая :: Питьевая :: Питьевая","/ХВС/Сбыт/Питьевая :: /ХВС/Транспортировка/Питьевая :: /ХВС/Производство/Питьевая",null,null,"31-12-2017 00:00:00","31-12-2017 00:00:00"]
[177,"Республика Башкортостан","Бураевский муниципальный район","80618000","Бураевский сельский совет","80618413","26353624","ООО \"Жилищник\"","0217004709","021701001","Оказание услуг в сфере водоснабжения","Подвоз воды :: Техническая :: Питьевая :: Техническая :: Питьевая :: Техническая :: Питьевая :: Очистка","/ХВС/Подвоз воды :: /ХВС/Сбыт/Техническая :: /ХВС/Сбыт/Питьевая :: /ХВС/Транспортировка/Техническая :: /ХВС/Транспортировка/Питьевая :: /ХВС/Производство/Техническая :: /ХВС/Производство/Питьевая :: /ХВС/Очистка",null,null,"15-09-2008 00:00:00"]
[178,"Республика Башкортостан","Бурзянский муниципальный район","80619000","Байназаровский сельский совет","80619410","28876686","Крестьянское (фермерское) хозяйство \"Валиев Надир Фасхитдинович\"","021800036900","отсутствует","Оказание услуг в сфере водоснабжения","Подвоз воды :: Техническая :: Питьевая :: Техническая :: Питьевая :: Техническая :: Питьевая :: Очистка","/ХВС/Подвоз воды :: /ХВС/Сбыт/Техническая :: /ХВС/Сбыт/Питьевая :: /ХВС/Транспортировка/Техническая :: /ХВС/Транспортировка/Питьевая :: /ХВС/Производство/Техническая :: /ХВС/Производство/Питьевая :: /ХВС/Очистка","28-01-2015 00:00:00",null,"08-07-2016 00:00:00"]
[179,"Республика Башкортостан","Бурзянский муниципальный район","80619000","Старосубхангуловский сельский совет","80619425","26619581","ООО \"КомЭнергоСервис\"","0218004003","021801001","Оказание услуг в сфере водоснабжения","Подвоз воды :: Техническая :: Питьевая :: Техническая :: Питьевая :: Техническая :: Питьевая :: Очистка","/ХВС/Подвоз воды :: /ХВС/Сбыт/Техническая :: /ХВС/Сбыт/Питьевая :: /ХВС/Транспортировка/Техническая :: /ХВС/Транспортировка/Питьевая :: /ХВС/Производство/Техническая :: /ХВС/Производство/Питьевая :: /ХВС/Очистка",null,null,"16-11-2010 00:00:00"]
[180,"Республика Башкортостан","Гафурийский муниципальный район","80621000","Белоозерский сельский совет","80621407","30434174","МУП \"АУРГАЗЫ-ВОДОКАНАЛ\"","0205007896","020501001","Оказание услуг в сфере водоснабжения","Питьевая :: Питьевая :: Очистка","/ХВС/Сбыт/Питьевая :: /ХВС/Производство/Питьевая :: /ХВС/Очистка","24-03-2016 00:00:00",null,"24-03-2016 00:00:00"]
[181,"Республика Башкортостан","Гафурийский муниципальный район","80621000","Красноусольский сельский совет","80621423","26471953","МУП \"Тепловодоснабжение\"","0219007350","021901001","Оказание услуг в сфере водоснабжения","Подвоз воды :: Техническая :: Питьевая :: Техническая :: Питьевая :: Техническая :: Питьевая :: Очистка","/ХВС/Подвоз воды :: /ХВС/Сбыт/Техническая :: /ХВС/Сбыт/Питьевая :: /ХВС/Транспортировка/Техническая :: /ХВС/Транспортировка/Питьевая :: /ХВС/Производство/Техническая :: /ХВС/Производство/Питьевая :: /ХВС/Очистка",null,null,"15-01-2010 00:00:00"]
[182,"Республика Башкортостан","Город Агидель","80703000","Город Агидель","80703000","26550657","ООО \"Управление Жилищно-Коммунального Хозяйства\"","0253018658","025301001","Оказание услуг в сфере водоснабжения","Подвоз воды :: Техническая :: Питьевая :: Техническая :: Питьевая :: Техническая :: Питьевая :: Очистка","/ХВС/Подвоз воды :: /ХВС/Сбыт/Техническая :: /ХВС/Сбыт/Питьевая :: /ХВС/Транспортировка/Техническая :: /ХВС/Транспортировка/Питьевая :: /ХВС/Производство/Техническая :: /ХВС/Производство/Питьевая :: /ХВС/Очистка",null,null,"29-07-2010 00:00:00"]
[183,"Республика Башкортостан","Город Кумертау","80723000","Город Кумертау","80723000","26471967","МУП \"Межрайкоммунводоканал\"","0262000343","026201001","Оказание услуг в сфере водоснабжения","Подвоз воды :: Техническая :: Питьевая :: Техническая :: Питьевая :: Техническая :: Питьевая :: Очистка","/ХВС/Подвоз воды :: /ХВС/Сбыт/Техническая :: /ХВС/Сбыт/Питьевая :: /ХВС/Транспортировка/Техническая :: /ХВС/Транспортировка/Питьевая :: /ХВС/Производство/Техническая :: /ХВС/Производство/Питьевая :: /ХВС/Очистка",null,null,"15-01-2010 00:00:00"]
[184,"Республика Башкортостан","Город Нефтекамск","80727000","Город Нефтекамск","80727000","26472019","Кармановская ГРЭС - филиал общества с огрниченной ответственностью \"Башкирская генерирующая компания\"","0277077282","026402001","Оказание услуг в сфере водоснабжения","Подвоз воды :: Техническая :: Питьевая :: Техническая :: Питьевая :: Техническая :: Питьевая :: Очистка","/ХВС/Подвоз воды :: /ХВС/Сбыт/Техническая :: /ХВС/Сбыт/Питьевая :: /ХВС/Транспортировка/Техническая :: /ХВС/Транспортировка/Питьевая :: /ХВС/Производство/Техническая :: /ХВС/Производство/Питьевая :: /ХВС/Очистка",null,null,"15-01-2010 00:00:00"]
[185,"Республика Башкортостан","Город Нефтекамск","80727000","Город Нефтекамск","80727000","26471975","МУП \"Нефтекамскводоканал\"","0264014479","026401001","Оказание услуг в сфере водоснабжения","Подвоз воды :: Техническая :: Питьевая :: Техническая :: Питьевая :: Техническая :: Питьевая :: Очистка","/ХВС/Подвоз воды :: /ХВС/Сбыт/Техническая :: /ХВС/Сбыт/Питьевая :: /ХВС/Транспортировка/Техническая :: /ХВС/Транспортировка/Питьевая :: /ХВС/Производство/Техническая :: /ХВС/Производство/Питьевая :: /ХВС/Очистка",null,null,"15-01-2010 00:00:00"]
[186,"Республика Башкортостан","Город Нефтекамск","80727000","Город Нефтекамск","80727000","26453634","ООО \"ЖКО-7\" город Нефтекамск","0264051777","026401001","Оказание услуг в сфере водоснабжения","Подвоз воды :: Техническая :: Питьевая :: Техническая :: Питьевая :: Техническая :: Питьевая :: Очистка","/ХВС/Подвоз воды :: /ХВС/Сбыт/Техническая :: /ХВС/Сбыт/Питьевая :: /ХВС/Транспортировка/Техническая :: /ХВС/Транспортировка/Питьевая :: /ХВС/Производство/Техническая :: /ХВС/Производство/Питьевая :: /ХВС/Очистка",null,null,"10-12-2009 00:00:00"]
[187,"Республика Башкортостан","Город Октябрьский","80735000","Город Октябрьский","80735000","26472030","МУП \"Октябрьсккоммунводоканал\"","0265026710","026501001","Транспортировка воды","Техническая :: Питьевая :: Техническая :: Питьевая :: Техническая :: Питьевая","/ХВС/Сбыт/Техническая :: /ХВС/Сбыт/Питьевая :: /ХВС/Транспортировка/Техническая :: /ХВС/Транспортировка/Питьевая :: /ХВС/Производство/Техническая :: /ХВС/Производство/Питьевая",null,null,"15-01-2010 00:00:00"]
[188,"Республика Башкортостан","Город Октябрьский","80735000","Город Октябрьский","80735000","26472030","МУП \"Октябрьсккоммунводоканал\"","0265026710","026501001","Оказание услуг в сфере водоснабжения","Техническая :: Питьевая :: Техническая :: Питьевая :: Техническая :: Питьевая","/ХВС/Сбыт/Техническая :: /ХВС/Сбыт/Питьевая :: /ХВС/Транспортировка/Техническая :: /ХВС/Транспортировка/Питьевая :: /ХВС/Производство/Техническая :: /ХВС/Производство/Питьевая",null,null,"15-01-2010 00:00:00"]
[189,"Республика Башкортостан","Город Салават","80739000","Город Салават","80739000","26812367","Куйбышевская дирекция  по тепловодоснабжению структурное подразделение Центральной дирекции по тепловодоснабжению филиала ПАО «РЖД»","7708503727","631145034","Оказание услуг в сфере водоснабжения","Питьевая :: Питьевая :: Питьевая","/ХВС/Сбыт/Питьевая :: /ХВС/Транспортировка/Питьевая :: /ХВС/Производство/Питьевая",null,null,"31-12-2017 00:00:00","31-12-2017 00:00:00"]
[190,"Республика Башкортостан","Город Салават","80739000","Город Салават","80739000","26812367","Куйбышевская дирекция  по тепловодоснабжению структурное подразделение Центральной дирекции по тепловодоснабжению филиала ПАО «РЖД»","7708503727","631145034","Транспортировка воды","Питьевая :: Питьевая :: Питьевая","/ХВС/Сбыт/Питьевая :: /ХВС/Транспортировка/Питьевая :: /ХВС/Производство/Питьевая",null,null,"31-12-2017 00:00:00","31-12-2017 00:00:00"]
[191,"Республика Башкортостан","Город Салават","80739000","Город Салават","80739000","26472048","МУП Межрайкоммунводоканал","0268000188","026801001","Оказание услуг в сфере водоснабжения","Техническая :: Питьевая :: Техническая :: Питьевая :: Техническая :: Питьевая","/ХВС/Сбыт/Техническая :: /ХВС/Сбыт/Питьевая :: /ХВС/Транспортировка/Техническая :: /ХВС/Транспортировка/Питьевая :: /ХВС/Производство/Техническая :: /ХВС/Производство/Питьевая",null,null,"15-01-2010 00:00:00","31-12-2017 00:00:00"]
[192,"Республика Башкортостан","Город Салават","80739000","Город Салават","80739000","26472048","МУП Межрайкоммунводоканал","0268000188","026801001","Транспортировка воды","Техническая :: Питьевая :: Техническая :: Питьевая :: Техническая :: Питьевая","/ХВС/Сбыт/Техническая :: /ХВС/Сбыт/Питьевая :: /ХВС/Транспортировка/Техническая :: /ХВС/Транспортировка/Питьевая :: /ХВС/Производство/Техническая :: /ХВС/Производство/Питьевая",null,null,"15-01-2010 00:00:00","31-12-2017 00:00:00"]
[193,"Республика Башкортостан","Город Салават","80739000","Город Салават","80739000","26472042","МУП Салаватводоканал","0266002905","026601001","Транспортировка воды","Техническая :: Питьевая :: Техническая :: Питьевая :: Техническая :: Питьевая","/ХВС/Сбыт/Техническая :: /ХВС/Сбыт/Питьевая :: /ХВС/Транспортировка/Техническая :: /ХВС/Транспортировка/Питьевая :: /ХВС/Производство/Техническая :: /ХВС/Производство/Питьевая",null,null,"15-01-2010 00:00:00"]
[194,"Республика Башкортостан","Город Салават","80739000","Город Салават","80739000","26472042","МУП Салаватводоканал","0266002905","026601001","Оказание услуг в сфере водоснабжения","Техническая :: Питьевая :: Техническая :: Питьевая :: Техническая :: Питьевая","/ХВС/Сбыт/Техническая :: /ХВС/Сбыт/Питьевая :: /ХВС/Транспортировка/Техническая :: /ХВС/Транспортировка/Питьевая :: /ХВС/Производство/Техническая :: /ХВС/Производство/Питьевая",null,null,"15-01-2010 00:00:00"]
[195,"Республика Башкортостан","Город Салават","80739000","Город Салават","80739000","26844058","ООО «Дом Сервис»","0266027699","026601001","Оказание услуг в сфере водоснабжения","Подвоз воды :: Техническая :: Питьевая :: Техническая :: Питьевая :: Техническая :: Питьевая :: Очистка","/ХВС/Подвоз воды :: /ХВС/Сбыт/Техническая :: /ХВС/Сбыт/Питьевая :: /ХВС/Транспортировка/Техническая :: /ХВС/Транспортировка/Питьевая :: /ХВС/Производство/Техническая :: /ХВС/Производство/Питьевая :: /ХВС/Очистка",null,null,"23-06-2011 00:00:00","31-12-2017 00:00:00"]
[196,"Республика Башкортостан","Город Салават","80739000","Город Салават","80739000","26754415","ООО «ПромВодоКанал»","0266033685","026601001","Оказание услуг в сфере водоснабжения","Подвоз воды :: Техническая :: Питьевая :: Техническая :: Питьевая :: Техническая :: Питьевая :: Очистка","/ХВС/Подвоз воды :: /ХВС/Сбыт/Техническая :: /ХВС/Сбыт/Питьевая :: /ХВС/Транспортировка/Техническая :: /ХВС/Транспортировка/Питьевая :: /ХВС/Производство/Техническая :: /ХВС/Производство/Питьевая :: /ХВС/Очистка",null,null,"25-01-2011 00:00:00"]
[197,"Республика Башкортостан","Город Сибай","80743000","Город Сибай","80743000","30350111","МУП \"Сибайводоканал\"","0267018087","026701001","Оказание услуг в сфере водоснабжения","Питьевая :: Питьевая","/ХВС/Сбыт/Питьевая :: /ХВС/Производство/Питьевая",null,null,"09-10-2015 00:00:00"]
[198,"Республика Башкортостан","Город Сибай","80743000","Город Сибай","80743000","27638844","ООО \"Водоканал\"","0267017076","026701001","Транспортировка воды","Питьевая","/ХВС/Транспортировка/Питьевая","02-03-2012 00:00:00",null,"02-03-2012 00:00:00","31-12-2017 00:00:00"]
[199,"Республика Башкортостан","Город Сибай","80743000","Город Сибай","80743000","26472058","ООО \"Водосбыт\"","0267011620","026701001","Оказание услуг в сфере водоснабжения","Подвоз воды :: Техническая :: Питьевая :: Техническая :: Питьевая :: Техническая :: Питьевая :: Очистка","/ХВС/Подвоз воды :: /ХВС/Сбыт/Техническая :: /ХВС/Сбыт/Питьевая :: /ХВС/Транспортировка/Техническая :: /ХВС/Транспортировка/Питьевая :: /ХВС/Производство/Техническая :: /ХВС/Производство/Питьевая :: /ХВС/Очистка",null,null,"15-01-2010 00:00:00","31-12-2017 00:00:00"]
[200,"Республика Башкортостан","Город Сибай","80743000","Город Сибай","80743000","27571052","ООО \"Газпром трансгаз Уфа\"","0276053659","997250001","Оказание услуг в сфере водоснабжения","Подвоз воды :: Техническая :: Питьевая :: Техническая :: Питьевая :: Техническая :: Питьевая :: Очистка","/ХВС/Подвоз воды :: /ХВС/Сбыт/Техническая :: /ХВС/Сбыт/Питьевая :: /ХВС/Транспортировка/Техническая :: /ХВС/Транспортировка/Питьевая :: /ХВС/Производство/Техническая :: /ХВС/Производство/Питьевая :: /ХВС/Очистка",null,null,"12-01-2012 00:00:00"]
[201,"Республика Башкортостан","Город Сибай","80743000","Город Сибай","80743000","26353692","Сибайский филиал ОАО \"Учалинский ГОК\"","0270007455","026702001","Транспортировка воды","Техническая :: Питьевая","/ХВС/Транспортировка/Техническая :: /ХВС/Транспортировка/Питьевая",null,null,"15-09-2008 00:00:00"]
[202,"Республика Башкортостан","Город Стерлитамак","80745000","Город Стерлитамак","80745000","26472063","АО \"БСК\"","0268008010","997350001","Оказание услуг в сфере водоснабжения","Техническая :: Питьевая :: Техническая :: Питьевая :: Техническая :: Питьевая","/ХВС/Сбыт/Техническая :: /ХВС/Сбыт/Питьевая :: /ХВС/Транспортировка/Техническая :: /ХВС/Транспортировка/Питьевая :: /ХВС/Производство/Техническая :: /ХВС/Производство/Питьевая",null,null,"15-01-2010 00:00:00"]
[203,"Республика Башкортостан","Город Стерлитамак","80745000","Город Стерлитамак","80745000","26472063","АО \"БСК\"","0268008010","997350001","Транспортировка воды","Техническая :: Питьевая :: Техническая :: Питьевая :: Техническая :: Питьевая","/ХВС/Сбыт/Техническая :: /ХВС/Сбыт/Питьевая :: /ХВС/Транспортировка/Техническая :: /ХВС/Транспортировка/Питьевая :: /ХВС/Производство/Техническая :: /ХВС/Производство/Питьевая",null,null,"15-01-2010 00:00:00"]
[204,"Республика Башкортостан","Город Стерлитамак","80745000","Город Стерлитамак","80745000","30791606","АО \"ГУ ЖКХ\"","5116000922","166045001","Транспортировка воды","Питьевая","/ХВС/Транспортировка/Питьевая",null,null,"02-09-2016 00:00:00","31-12-2017 00:00:00"]
[205,"Республика Башкортостан","Город Стерлитамак","80745000","Город Стерлитамак","80745000","30335229","АО \"ГУ ЖКХ\"","5116000922","770401001","Транспортировка воды","Питьевая","/ХВС/Транспортировка/Питьевая",null,null,"08-10-2015 00:00:00","31-12-2017 00:00:00"]
[206,"Республика Башкортостан","Город Стерлитамак","80745000","Город Стерлитамак","80745000","26758634","ЗАО \"Водоснабжающая компания\"","0268055772","026801001","Оказание услуг в сфере водоснабжения","Подвоз воды :: Техническая :: Питьевая :: Техническая :: Питьевая :: Техническая :: Питьевая :: Очистка","/ХВС/Подвоз воды :: /ХВС/Сбыт/Техническая :: /ХВС/Сбыт/Питьевая :: /ХВС/Транспортировка/Техническая :: /ХВС/Транспортировка/Питьевая :: /ХВС/Производство/Техническая :: /ХВС/Производство/Питьевая :: /ХВС/Очистка",null,null,"31-01-2011 00:00:00"]
[207,"Республика Башкортостан","Город Стерлитамак","80745000","Город Стерлитамак","80745000","27571052","ООО \"Газпром трансгаз Уфа\"","0276053659","997250001","Оказание услуг в сфере водоснабжения","Подвоз воды :: Техническая :: Питьевая :: Техническая :: Питьевая :: Техническая :: Питьевая :: Очистка","/ХВС/Подвоз воды :: /ХВС/Сбыт/Техническая :: /ХВС/Сбыт/Питьевая :: /ХВС/Транспортировка/Техническая :: /ХВС/Транспортировка/Питьевая :: /ХВС/Производство/Техническая :: /ХВС/Производство/Питьевая :: /ХВС/Очистка",null,null,"12-01-2012 00:00:00"]
[208,"Республика Башкортостан","Город Стерлитамак","80745000","Город Стерлитамак","80745000","27676834","ООО \"Первая Сетевая Компания\"","0268072425","026801001","Оказание услуг в сфере водоснабжения","Подвоз воды :: Техническая :: Питьевая :: Техническая :: Питьевая :: Техническая :: Питьевая :: Очистка","/ХВС/Подвоз воды :: /ХВС/Сбыт/Техническая :: /ХВС/Сбыт/Питьевая :: /ХВС/Транспортировка/Техническая :: /ХВС/Транспортировка/Питьевая :: /ХВС/Производство/Техническая :: /ХВС/Производство/Питьевая :: /ХВС/Очистка","17-04-2012 00:00:00",null,"17-04-2012 00:00:00","31-12-2017 00:00:00"]
[209,"Республика Башкортостан","Город Уфа","80701000","Город Уфа","80701000","26807163","OOO \"Башэнергонефть\"","0265025917","027201001","Оказание услуг в сфере водоснабжения","Подвоз воды :: Техническая :: Питьевая :: Техническая :: Техническая :: Питьевая :: Очистка","/ХВС/Подвоз воды :: /ХВС/Сбыт/Техническая :: /ХВС/Сбыт/Питьевая :: /ХВС/Транспортировка/Техническая :: /ХВС/Производство/Техническая :: /ХВС/Производство/Питьевая :: /ХВС/Очистка","12-04-2011 00:00:00",null,"12-04-2011 00:00:00","31-12-2017 00:00:00"]
[210,"Республика Башкортостан","Город Уфа","80701000","Город Уфа","80701000","26807163","OOO \"Башэнергонефть\"","0265025917","027201001","Транспортировка воды","Питьевая","/ХВС/Транспортировка/Питьевая","12-04-2011 00:00:00",null,"27-01-2016 00:00:00","31-12-2017 00:00:00"]
[211,"Республика Башкортостан","Город Уфа","80701000","Город Уфа","80701000","28031785","OOO \"Октябрьское УЭН\"","0265025917","027601001","Оказание услуг в сфере водоснабжения","Подвоз воды :: Техническая :: Питьевая :: Техническая :: Питьевая :: Техническая :: Питьевая :: Очистка","/ХВС/Подвоз воды :: /ХВС/Сбыт/Техническая :: /ХВС/Сбыт/Питьевая :: /ХВС/Транспортировка/Техническая :: /ХВС/Транспортировка/Питьевая :: /ХВС/Производство/Техническая :: /ХВС/Производство/Питьевая :: /ХВС/Очистка","10-01-2013 00:00:00",null,"10-01-2013 00:00:00","31-12-2017 00:00:00"]
[212,"Республика Башкортостан","Город Уфа","80701000","Город Уфа","80701000","30335229","АО \"ГУ ЖКХ\"","5116000922","770401001","Оказание услуг в сфере водоснабжения","Питьевая","/ХВС/Производство/Питьевая",null,null,"08-10-2015 00:00:00","31-12-2017 00:00:00"]
[213,"Республика Башкортостан","Город Уфа","80701000","Город Уфа","80701000","30335229","АО \"ГУ ЖКХ\"","5116000922","770401001","Транспортировка воды","Питьевая","/ХВС/Транспортировка/Питьевая",null,null,"31-01-2017 00:00:00","31-12-2017 00:00:00"]
[214,"Республика Башкортостан","Город Уфа","80701000","Город Уфа","80701000","30791606","АО \"ГУ ЖКХ\"","5116000922","166045001","Оказание услуг в сфере водоснабжения","Питьевая","/ХВС/Производство/Питьевая",null,null,"02-09-2016 00:00:00","31-12-2017 00:00:00"]
[215,"Республика Башкортостан","Город Уфа","80701000","Город Уфа","80701000","26588634","АО \"УМКК\"","0273010086","027301001","Транспортировка воды","Техническая :: Питьевая :: Техническая :: Питьевая :: Техническая :: Питьевая","/ХВС/Сбыт/Техническая :: /ХВС/Сбыт/Питьевая :: /ХВС/Транспортировка/Техническая :: /ХВС/Транспортировка/Питьевая :: /ХВС/Производство/Техническая :: /ХВС/Производство/Питьевая",null,null,"03-11-2010 00:00:00","31-12-2017 00:00:00"]
[216,"Республика Башкортостан","Город Уфа","80701000","Город Уфа","80701000","26588634","АО \"УМКК\"","0273010086","027301001","Оказание услуг в сфере водоснабжения","Техническая :: Питьевая :: Техническая :: Питьевая :: Техническая :: Питьевая","/ХВС/Сбыт/Техническая :: /ХВС/Сбыт/Питьевая :: /ХВС/Транспортировка/Техническая :: /ХВС/Транспортировка/Питьевая :: /ХВС/Производство/Техническая :: /ХВС/Производство/Питьевая",null,null,"03-11-2010 00:00:00","31-12-2017 00:00:00"]
[217,"Республика Башкортостан","Город Уфа","80701000","Город Уфа","80701000","26825369","ЗАО \"Фирма \"Мир\"","0278134166","027801001","Оказание услуг в сфере водоснабжения","Подвоз воды :: Техническая :: Питьевая :: Техническая :: Питьевая :: Техническая :: Питьевая :: Очистка","/ХВС/Подвоз воды :: /ХВС/Сбыт/Техническая :: /ХВС/Сбыт/Питьевая :: /ХВС/Транспортировка/Техническая :: /ХВС/Транспортировка/Питьевая :: /ХВС/Производство/Техническая :: /ХВС/Производство/Питьевая :: /ХВС/Очистка",null,null,"16-05-2011 00:00:00"]
[218,"Республика Башкортостан","Город Уфа","80701000","Город Уфа","80701000","26812367","Куйбышевская дирекция  по тепловодоснабжению структурное подразделение Центральной дирекции по тепловодоснабжению филиала ПАО «РЖД»","7708503727","631145034","Транспортировка воды","Питьевая :: Питьевая :: Питьевая","/ХВС/Сбыт/Питьевая :: /ХВС/Транспортировка/Питьевая :: /ХВС/Производство/Питьевая",null,null,"31-12-2017 00:00:00","31-12-2017 00:00:00"]
[219,"Республика Башкортостан","Город Уфа","80701000","Город Уфа","80701000","26812367","Куйбышевская дирекция  по тепловодоснабжению структурное подразделение Центральной дирекции по тепловодоснабжению филиала ПАО «РЖД»","7708503727","631145034","Оказание услуг в сфере водоснабжения","Питьевая :: Питьевая :: Питьевая","/ХВС/Сбыт/Питьевая :: /ХВС/Транспортировка/Питьевая :: /ХВС/Производство/Питьевая",null,null,"31-12-2017 00:00:00","31-12-2017 00:00:00"]
[220,"Республика Башкортостан","Город Уфа","80701000","Город Уфа","80701000","27573761","МУП \"Дирекция по строительству и содержанию жилого массива в районе пос. Чесноковка\"","0274138184","027401001","Оказание услуг в сфере водоснабжения","Техническая","/ХВС/Производство/Техническая","30-10-2015 00:00:00",null,"30-10-2015 00:00:00","31-12-2017 00:00:00"]
[221,"Республика Башкортостан","Город Уфа","80701000","Город Уфа","80701000","26472069","МУП \"Уфаводоканал\"","0275000238","027601001","Оказание услуг в сфере водоснабжения","Подвоз воды :: Техническая :: Питьевая :: Техническая :: Питьевая :: Техническая :: Питьевая :: Очистка","/ХВС/Подвоз воды :: /ХВС/Сбыт/Техническая :: /ХВС/Сбыт/Питьевая :: /ХВС/Транспортировка/Техническая :: /ХВС/Транспортировка/Питьевая :: /ХВС/Производство/Техническая :: /ХВС/Производство/Питьевая :: /ХВС/Очистка",null,null,"15-01-2010 00:00:00"]
[222,"Республика Башкортостан","Город Уфа","80701000","Город Уфа","80701000","26453912","ОАО \"УКХП\" город Уфа","0274092758","027401001","Оказание услуг в сфере водоснабжения","Подвоз воды :: Техническая :: Питьевая :: Техническая :: Питьевая :: Техническая :: Питьевая :: Очистка","/ХВС/Подвоз воды :: /ХВС/Сбыт/Техническая :: /ХВС/Сбыт/Питьевая :: /ХВС/Транспортировка/Техническая :: /ХВС/Транспортировка/Питьевая :: /ХВС/Производство/Техническая :: /ХВС/Производство/Питьевая :: /ХВС/Очистка",null,null,"10-12-2009 00:00:00"]
[223,"Республика Башкортостан","Город Уфа","80701000","Город Уфа","80701000","26621297","ОАО \"Уфанефтехим\"","0277012020","997150001","Оказание услуг в сфере водоснабжения","Техническая :: Питьевая :: Техническая :: Питьевая :: Техническая :: Питьевая","/ХВС/Сбыт/Техническая :: /ХВС/Сбыт/Питьевая :: /ХВС/Транспортировка/Техническая :: /ХВС/Транспортировка/Питьевая :: /ХВС/Производство/Техническая :: /ХВС/Производство/Питьевая",null,null,"16-11-2010 00:00:00","31-12-2017 00:00:00"]
[224,"Республика Башкортостан","Город Уфа","80701000","Город Уфа","80701000","26621297","ОАО \"Уфанефтехим\"","0277012020","997150001","Транспортировка воды","Техническая :: Питьевая :: Техническая :: Питьевая :: Техническая :: Питьевая","/ХВС/Сбыт/Техническая :: /ХВС/Сбыт/Питьевая :: /ХВС/Транспортировка/Техническая :: /ХВС/Транспортировка/Питьевая :: /ХВС/Производство/Техническая :: /ХВС/Производство/Питьевая",null,null,"16-11-2010 00:00:00","31-12-2017 00:00:00"]
[225,"Республика Башкортостан","Город Уфа","80701000","Город Уфа","80701000","26569789","ОАО \"Уфимское моторостроительное производственное объединение\"","0273008320","997850001","Транспортировка воды","Техническая :: Питьевая","/ХВС/Транспортировка/Техническая :: /ХВС/Транспортировка/Питьевая",null,null,"15-10-2010 00:00:00","31-12-2017 00:00:00"]
[226,"Республика Башкортостан","Город Уфа","80701000","Город Уфа","80701000","27149135","ОАО \"Уфимское приборостроительное производственное объединение\"","0276140862","027601001","Оказание услуг в сфере водоснабжения","Подвоз воды :: Техническая :: Питьевая :: Техническая :: Питьевая :: Техническая :: Питьевая :: Очистка","/ХВС/Подвоз воды :: /ХВС/Сбыт/Техническая :: /ХВС/Сбыт/Питьевая :: /ХВС/Транспортировка/Техническая :: /ХВС/Транспортировка/Питьевая :: /ХВС/Производство/Техническая :: /ХВС/Производство/Питьевая :: /ХВС/Очистка",null,null,"19-09-2011 00:00:00","31-12-2017 00:00:00"]
[227,"Республика Башкортостан","Город Уфа","80701000","Город Уфа","80701000","30942075","ООО \"Башнефть-Добыча\"","0277106840","025250001","Оказание услуг в сфере водоснабжения","Техническая :: Питьевая :: Техническая :: Питьевая :: Очистка","/ХВС/Сбыт/Техническая :: /ХВС/Сбыт/Питьевая :: /ХВС/Производство/Техническая :: /ХВС/Производство/Питьевая :: /ХВС/Очистка","15-08-2017 00:00:00",null,"15-08-2017 00:00:00"]
[228,"Республика Башкортостан","Город Уфа","80701000","Город Уфа","80701000","27571052","ООО \"Газпром трансгаз Уфа\"","0276053659","997250001","Оказание услуг в сфере водоснабжения","Подвоз воды :: Техническая :: Питьевая :: Техническая :: Питьевая :: Техническая :: Питьевая :: Очистка","/ХВС/Подвоз воды :: /ХВС/Сбыт/Техническая :: /ХВС/Сбыт/Питьевая :: /ХВС/Транспортировка/Техническая :: /ХВС/Транспортировка/Питьевая :: /ХВС/Производство/Техническая :: /ХВС/Производство/Питьевая :: /ХВС/Очистка",null,null,"12-01-2012 00:00:00"]
[229,"Республика Башкортостан","Город Уфа","80701000","Город Уфа","80701000","28005474","ООО «Башнефть – Сервис НПЗ»","0275075378","027501001","Транспортировка воды","Техническая :: Питьевая :: Техническая :: Питьевая :: Техническая :: Питьевая","/ХВС/Сбыт/Техническая :: /ХВС/Сбыт/Питьевая :: /ХВС/Транспортировка/Техническая :: /ХВС/Транспортировка/Питьевая :: /ХВС/Производство/Техническая :: /ХВС/Производство/Питьевая","19-12-2012 00:00:00",null,"19-12-2012 00:00:00"]
[230,"Республика Башкортостан","Город Уфа","80701000","Город Уфа","80701000","28005474","ООО «Башнефть – Сервис НПЗ»","0275075378","027501001","Оказание услуг в сфере водоснабжения","Техническая :: Питьевая :: Техническая :: Питьевая :: Техническая :: Питьевая","/ХВС/Сбыт/Техническая :: /ХВС/Сбыт/Питьевая :: /ХВС/Транспортировка/Техническая :: /ХВС/Транспортировка/Питьевая :: /ХВС/Производство/Техническая :: /ХВС/Производство/Питьевая","19-12-2012 00:00:00",null,"19-12-2012 00:00:00"]
[231,"Республика Башкортостан","Город Уфа","80701000","Город Уфа","80701000","30914574","Филиал ФГБУ \"ЦЖКУ\" МИНОБОРОНЫ РОССИИ (по ЦВО)","7729314745","667043001","Транспортировка воды","Питьевая","/ХВС/Транспортировка/Питьевая",null,null,"08-06-2017 00:00:00"]
[232,"Республика Башкортостан","Давлекановский муниципальный район","80622000","Город Давлеканово","80622101","28152448","ДМУП \"ГорКомСервис\"","0259011320","025901001","Оказание услуг в сфере водоснабжения","Питьевая :: Питьевая","/ХВС/Сбыт/Питьевая :: /ХВС/Производство/Питьевая","03-06-2013 00:00:00",null,"30-12-2015 00:00:00"]
[233,"Республика Башкортостан","Давлекановский муниципальный район","80622000","Город Давлеканово","80622101","26812367","Куйбышевская дирекция  по тепловодоснабжению структурное подразделение Центральной дирекции по тепловодоснабжению филиала ПАО «РЖД»","7708503727","631145034","Транспортировка воды","Питьевая :: Питьевая :: Питьевая","/ХВС/Сбыт/Питьевая :: /ХВС/Транспортировка/Питьевая :: /ХВС/Производство/Питьевая",null,null,"31-12-2017 00:00:00","31-12-2017 00:00:00"]
[234,"Республика Башкортостан","Давлекановский муниципальный район","80622000","Город Давлеканово","80622101","26812367","Куйбышевская дирекция  по тепловодоснабжению структурное подразделение Центральной дирекции по тепловодоснабжению филиала ПАО «РЖД»","7708503727","631145034","Оказание услуг в сфере водоснабжения","Питьевая :: Питьевая :: Питьевая","/ХВС/Сбыт/Питьевая :: /ХВС/Транспортировка/Питьевая :: /ХВС/Производство/Питьевая",null,null,"31-12-2017 00:00:00","31-12-2017 00:00:00"]
[235,"Республика Башкортостан","Давлекановский муниципальный район","80622000","Казангуловский сельский совет","80622422","26812367","Куйбышевская дирекция  по тепловодоснабжению структурное подразделение Центральной дирекции по тепловодоснабжению филиала ПАО «РЖД»","7708503727","631145034","Транспортировка воды","Питьевая :: Питьевая :: Питьевая","/ХВС/Сбыт/Питьевая :: /ХВС/Транспортировка/Питьевая :: /ХВС/Производство/Питьевая",null,null,"31-12-2017 00:00:00","31-12-2017 00:00:00"]
[236,"Республика Башкортостан","Давлекановский муниципальный район","80622000","Казангуловский сельский совет","80622422","26812367","Куйбышевская дирекция  по тепловодоснабжению структурное подразделение Центральной дирекции по тепловодоснабжению филиала ПАО «РЖД»","7708503727","631145034","Оказание услуг в сфере водоснабжения","Питьевая :: Питьевая :: Питьевая","/ХВС/Сбыт/Питьевая :: /ХВС/Транспортировка/Питьевая :: /ХВС/Производство/Питьевая",null,null,"31-12-2017 00:00:00","31-12-2017 00:00:00"]
[237,"Республика Башкортостан","Дуванский муниципальный район","80623000","Месягутовский сельский совет","80623422","26353627","МУП \"Дуванводоканал\" МР Дуванский район РБ","0220004836","022001001","Оказание услуг в сфере водоснабжения","Подвоз воды :: Техническая :: Питьевая :: Техническая :: Питьевая :: Техническая :: Питьевая :: Очистка","/ХВС/Подвоз воды :: /ХВС/Сбыт/Техническая :: /ХВС/Сбыт/Питьевая :: /ХВС/Транспортировка/Техническая :: /ХВС/Транспортировка/Питьевая :: /ХВС/Производство/Техническая :: /ХВС/Производство/Питьевая :: /ХВС/Очистка",null,null,"15-09-2008 00:00:00"]
[238,"Республика Башкортостан","Дюртюлинский муниципальный район","80624000","Асяновский сельский совет","80624407","30839066","ООО УК \"Керамик\"","0260011808","026001001","Транспортировка воды","Питьевая :: Питьевая :: Питьевая","/ХВС/Сбыт/Питьевая :: /ХВС/Транспортировка/Питьевая :: /ХВС/Производство/Питьевая",null,null,"29-09-2016 00:00:00"]
[239,"Республика Башкортостан","Дюртюлинский муниципальный район","80624000","Асяновский сельский совет","80624407","30839066","ООО УК \"Керамик\"","0260011808","026001001","Оказание услуг в сфере водоснабжения","Питьевая :: Питьевая :: Питьевая","/ХВС/Сбыт/Питьевая :: /ХВС/Транспортировка/Питьевая :: /ХВС/Производство/Питьевая",null,null,"29-09-2016 00:00:00"]
[240,"Республика Башкортостан","Дюртюлинский муниципальный район","80624000","Город Дюртюли","80624101","27745143","МУП \"Дюртюливодоканал\"","0260006195","026001001","Оказание услуг в сфере водоснабжения","Подвоз воды :: Техническая :: Питьевая :: Техническая :: Питьевая :: Техническая :: Питьевая :: Очистка","/ХВС/Подвоз воды :: /ХВС/Сбыт/Техническая :: /ХВС/Сбыт/Питьевая :: /ХВС/Транспортировка/Техническая :: /ХВС/Транспортировка/Питьевая :: /ХВС/Производство/Техническая :: /ХВС/Производство/Питьевая :: /ХВС/Очистка","18-06-2012 00:00:00",null,"18-06-2012 00:00:00"]
[241,"Республика Башкортостан","Дюртюлинский муниципальный район","80624000","Город Дюртюли","80624101","26754461","ООО «Дюртюли-Водоканал»","0260010586","026001001","Оказание услуг в сфере водоснабжения","Подвоз воды :: Техническая :: Питьевая :: Техническая :: Питьевая :: Техническая :: Питьевая :: Очистка","/ХВС/Подвоз воды :: /ХВС/Сбыт/Техническая :: /ХВС/Сбыт/Питьевая :: /ХВС/Транспортировка/Техническая :: /ХВС/Транспортировка/Питьевая :: /ХВС/Производство/Техническая :: /ХВС/Производство/Питьевая :: /ХВС/Очистка",null,null,"26-01-2011 00:00:00","31-12-2017 00:00:00"]
[242,"Республика Башкортостан","Дюртюлинский муниципальный район","80624000","Исмаиловский сельский совет","80624410","28502768","ООО \"Речник\"","0260009446","026001001","Оказание услуг в сфере водоснабжения","Подвоз воды :: Техническая :: Питьевая :: Техническая :: Питьевая :: Техническая :: Питьевая :: Очистка","/ХВС/Подвоз воды :: /ХВС/Сбыт/Техническая :: /ХВС/Сбыт/Питьевая :: /ХВС/Транспортировка/Техническая :: /ХВС/Транспортировка/Питьевая :: /ХВС/Производство/Техническая :: /ХВС/Производство/Питьевая :: /ХВС/Очистка",null,null,"23-04-2014 00:00:00"]
[243,"Республика Башкортостан","Дюртюлинский муниципальный район","80624000","Московский сельский совет","80624422","27182754","ООО \"ЖКХ С.МОСКОВО\"","0260012390","026001001","Оказание услуг в сфере водоснабжения","Подвоз воды :: Техническая :: Питьевая :: Техническая :: Питьевая :: Техническая :: Питьевая :: Очистка","/ХВС/Подвоз воды :: /ХВС/Сбыт/Техническая :: /ХВС/Сбыт/Питьевая :: /ХВС/Транспортировка/Техническая :: /ХВС/Транспортировка/Питьевая :: /ХВС/Производство/Техническая :: /ХВС/Производство/Питьевая :: /ХВС/Очистка",null,null,"26-09-2011 00:00:00"]
[244,"Республика Башкортостан","Дюртюлинский муниципальный район","80624000","Семилетовский сельский совет","80624430","26353676","МУП \"Семилетовское ПУЖКХ\"","0260005970","026001001","Оказание услуг в сфере водоснабжения","Подвоз воды :: Техническая :: Питьевая :: Техническая :: Питьевая :: Техническая :: Питьевая :: Очистка","/ХВС/Подвоз воды :: /ХВС/Сбыт/Техническая :: /ХВС/Сбыт/Питьевая :: /ХВС/Транспортировка/Техническая :: /ХВС/Транспортировка/Питьевая :: /ХВС/Производство/Техническая :: /ХВС/Производство/Питьевая :: /ХВС/Очистка",null,null,"15-09-2008 00:00:00","31-12-2017 00:00:00"]
[245,"Республика Башкортостан","Дюртюлинский муниципальный район","80624000","Семилетовский сельский совет","80624430","31007428","ООО ЖКХ с. Семилетка","0260011460","026001001","Транспортировка воды","Техническая :: Техническая :: Техническая","/ХВС/Сбыт/Техническая :: /ХВС/Транспортировка/Техническая :: /ХВС/Производство/Техническая","25-12-2017 00:00:00",null,"25-12-2017 00:00:00","25-12-2017 00:00:00"]
[246,"Республика Башкортостан","Дюртюлинский муниципальный район","80624000","Семилетовский сельский совет","80624430","31007428","ООО ЖКХ с. Семилетка","0260011460","026001001","Оказание услуг в сфере водоснабжения","Техническая :: Техническая :: Техническая","/ХВС/Сбыт/Техническая :: /ХВС/Транспортировка/Техническая :: /ХВС/Производство/Техническая","25-12-2017 00:00:00",null,"25-12-2017 00:00:00","25-12-2017 00:00:00"]
[247,"Республика Башкортостан","Дюртюлинский муниципальный район","80624000","Семилетовский сельский совет","80624430","31007428","ООО ЖКХ с. Семилетка","0260011460","026001001","Оказание услуг в сфере водоснабжения","Подвоз воды :: Питьевая :: Питьевая :: Питьевая :: Очистка","/ХВС/Подвоз воды :: /ХВС/Сбыт/Питьевая :: /ХВС/Транспортировка/Питьевая :: /ХВС/Производство/Питьевая :: /ХВС/Очистка","25-12-2017 00:00:00",null,"25-12-2017 00:00:00"]
[248,"Республика Башкортостан","Ермекеевский муниципальный район","80625000","Ермекеевский сельский совет","80625407","26812367","Куйбышевская дирекция  по тепловодоснабжению структурное подразделение Центральной дирекции по тепловодоснабжению филиала ПАО «РЖД»","7708503727","631145034","Транспортировка воды","Питьевая :: Питьевая :: Питьевая","/ХВС/Сбыт/Питьевая :: /ХВС/Транспортировка/Питьевая :: /ХВС/Производство/Питьевая",null,null,"31-12-2017 00:00:00","31-12-2017 00:00:00"]
[249,"Республика Башкортостан","Ермекеевский муниципальный район","80625000","Ермекеевский сельский совет","80625407","26812367","Куйбышевская дирекция  по тепловодоснабжению структурное подразделение Центральной дирекции по тепловодоснабжению филиала ПАО «РЖД»","7708503727","631145034","Оказание услуг в сфере водоснабжения","Питьевая :: Питьевая :: Питьевая","/ХВС/Сбыт/Питьевая :: /ХВС/Транспортировка/Питьевая :: /ХВС/Производство/Питьевая",null,null,"31-12-2017 00:00:00","31-12-2017 00:00:00"]
[250,"Республика Башкортостан","Ермекеевский муниципальный район","80625000","Ермекеевский сельский совет","80625407","27588330","ООО \"Сель-водоканал\"","0255017040","022101001","Оказание услуг в сфере водоснабжения","Подвоз воды :: Техническая :: Питьевая :: Техническая :: Питьевая :: Техническая :: Питьевая :: Очистка","/ХВС/Подвоз воды :: /ХВС/Сбыт/Техническая :: /ХВС/Сбыт/Питьевая :: /ХВС/Транспортировка/Техническая :: /ХВС/Транспортировка/Питьевая :: /ХВС/Производство/Техническая :: /ХВС/Производство/Питьевая :: /ХВС/Очистка",null,null,"23-01-2012 00:00:00"]
[251,"Республика Башкортостан","Ермекеевский муниципальный район","80625000","Ермекеевский сельский совет","80625407","26764356","ООО \"Сельэнерго\"","0221005374","022101001","Оказание услуг в сфере водоснабжения","Подвоз воды :: Техническая :: Питьевая :: Техническая :: Питьевая :: Техническая :: Питьевая :: Очистка","/ХВС/Подвоз воды :: /ХВС/Сбыт/Техническая :: /ХВС/Сбыт/Питьевая :: /ХВС/Транспортировка/Техническая :: /ХВС/Транспортировка/Питьевая :: /ХВС/Производство/Техническая :: /ХВС/Производство/Питьевая :: /ХВС/Очистка",null,null,"03-02-2011 00:00:00"]
[252,"Республика Башкортостан","Ермекеевский муниципальный район","80625000","Усман-Ташлинский сельский совет","80625440","26812367","Куйбышевская дирекция  по тепловодоснабжению структурное подразделение Центральной дирекции по тепловодоснабжению филиала ПАО «РЖД»","7708503727","631145034","Оказание услуг в сфере водоснабжения","Питьевая :: Питьевая :: Питьевая","/ХВС/Сбыт/Питьевая :: /ХВС/Транспортировка/Питьевая :: /ХВС/Производство/Питьевая",null,null,"31-12-2017 00:00:00","31-12-2017 00:00:00"]
[253,"Республика Башкортостан","Ермекеевский муниципальный район","80625000","Усман-Ташлинский сельский совет","80625440","26812367","Куйбышевская дирекция  по тепловодоснабжению структурное подразделение Центральной дирекции по тепловодоснабжению филиала ПАО «РЖД»","7708503727","631145034","Транспортировка воды","Питьевая :: Питьевая :: Питьевая","/ХВС/Сбыт/Питьевая :: /ХВС/Транспортировка/Питьевая :: /ХВС/Производство/Питьевая",null,null,"31-12-2017 00:00:00","31-12-2017 00:00:00"]
[254,"Республика Башкортостан","ЗАТО город Межгорье","80707000","ЗАТО город Межгорье","80707000","30335229","АО \"ГУ ЖКХ\"","5116000922","770401001","Транспортировка воды","Питьевая :: Питьевая","/ХВС/Транспортировка/Питьевая :: /ХВС/Производство/Питьевая",null,null,"08-10-2015 00:00:00","31-12-2017 00:00:00"]
[255,"Республика Башкортостан","ЗАТО город Межгорье","80707000","ЗАТО город Межгорье","80707000","30791606","АО \"ГУ ЖКХ\"","5116000922","166045001","Транспортировка воды","Питьевая :: Питьевая","/ХВС/Транспортировка/Питьевая :: /ХВС/Производство/Питьевая",null,null,"02-09-2016 00:00:00","31-12-2017 00:00:00"]
[256,"Республика Башкортостан","ЗАТО город Межгорье","80707000","ЗАТО город Межгорье","80707000","30335229","АО \"ГУ ЖКХ\"","5116000922","770401001","Оказание услуг в сфере водоснабжения","Питьевая :: Питьевая","/ХВС/Транспортировка/Питьевая :: /ХВС/Производство/Питьевая",null,null,"08-10-2015 00:00:00","31-12-2017 00:00:00"]
[257,"Республика Башкортостан","ЗАТО город Межгорье","80707000","ЗАТО город Межгорье","80707000","30791606","АО \"ГУ ЖКХ\"","5116000922","166045001","Оказание услуг в сфере водоснабжения","Питьевая :: Питьевая","/ХВС/Транспортировка/Питьевая :: /ХВС/Производство/Питьевая",null,null,"02-09-2016 00:00:00","31-12-2017 00:00:00"]
[258,"Республика Башкортостан","ЗАТО город Межгорье","80707000","ЗАТО город Межгорье","80707000","26353716","МУП \"ЖКХ\" г.Межгорье","0279000849","027901001","Оказание услуг в сфере водоснабжения","Подвоз воды :: Техническая :: Питьевая :: Техническая :: Питьевая :: Техническая :: Питьевая :: Очистка","/ХВС/Подвоз воды :: /ХВС/Сбыт/Техническая :: /ХВС/Сбыт/Питьевая :: /ХВС/Транспортировка/Техническая :: /ХВС/Транспортировка/Питьевая :: /ХВС/Производство/Техническая :: /ХВС/Производство/Питьевая :: /ХВС/Очистка",null,null,"15-09-2008 00:00:00"]
[259,"Республика Башкортостан","ЗАТО город Межгорье","80707000","ЗАТО город Межгорье","80707000","26852317","ОАО \"Славянка\"","7702707386","745343001","Оказание услуг в сфере водоснабжения","Подвоз воды :: Техническая :: Питьевая :: Техническая :: Питьевая :: Техническая :: Питьевая :: Очистка","/ХВС/Подвоз воды :: /ХВС/Сбыт/Техническая :: /ХВС/Сбыт/Питьевая :: /ХВС/Транспортировка/Техническая :: /ХВС/Транспортировка/Питьевая :: /ХВС/Производство/Техническая :: /ХВС/Производство/Питьевая :: /ХВС/Очистка","12-07-2011 00:00:00",null,"12-07-2011 00:00:00","31-12-2017 00:00:00"]
[260,"Республика Башкортостан","ЗАТО город Межгорье","80707000","ЗАТО город Межгорье","80707000","30914574","Филиал ФГБУ \"ЦЖКУ\" МИНОБОРОНЫ РОССИИ (по ЦВО)","7729314745","667043001","Оказание услуг в сфере водоснабжения","Питьевая :: Питьевая","/ХВС/Сбыт/Питьевая :: /ХВС/Производство/Питьевая",null,null,"08-06-2017 00:00:00"]
[261,"Республика Башкортостан","Зианчуринский муниципальный район","80626000","Исянгуловский сельский совет","80626416","30434085","МУП СП ИСЯНГУЛОВСКИЙ СЕЛЬСОВЕТ МР ЗИАНЧУРИНСКИЙ РАЙОН РБ \"ЖКСК\"","0222007342","022201001","Оказание услуг в сфере водоснабжения","Питьевая :: Питьевая :: Очистка","/ХВС/Сбыт/Питьевая :: /ХВС/Производство/Питьевая :: /ХВС/Очистка","24-03-2016 00:00:00",null,"24-03-2016 00:00:00"]
[262,"Республика Башкортостан","Зилаирский муниципальный район","80627000","Зилаирский сельский совет","80627416","28450342","ООО \"Водоканал\"","0223004552","022301001","Оказание услуг в сфере водоснабжения","Подвоз воды :: Техническая :: Питьевая :: Техническая :: Питьевая :: Техническая :: Питьевая :: Очистка","/ХВС/Подвоз воды :: /ХВС/Сбыт/Техническая :: /ХВС/Сбыт/Питьевая :: /ХВС/Транспортировка/Техническая :: /ХВС/Транспортировка/Питьевая :: /ХВС/Производство/Техническая :: /ХВС/Производство/Питьевая :: /ХВС/Очистка","30-12-2013 00:00:00",null,"30-12-2013 00:00:00"]
[263,"Республика Башкортостан","Иглинский муниципальный район","80628000","Иглинский сельский совет","80628416","26812367","Куйбышевская дирекция  по тепловодоснабжению структурное подразделение Центральной дирекции по тепловодоснабжению филиала ПАО «РЖД»","7708503727","631145034","Оказание услуг в сфере водоснабжения","Питьевая :: Питьевая :: Питьевая","/ХВС/Сбыт/Питьевая :: /ХВС/Транспортировка/Питьевая :: /ХВС/Производство/Питьевая",null,null,"31-12-2017 00:00:00","31-12-2017 00:00:00"]
[264,"Республика Башкортостан","Иглинский муниципальный район","80628000","Иглинский сельский совет","80628416","26812367","Куйбышевская дирекция  по тепловодоснабжению структурное подразделение Центральной дирекции по тепловодоснабжению филиала ПАО «РЖД»","7708503727","631145034","Транспортировка воды","Питьевая :: Питьевая :: Питьевая","/ХВС/Сбыт/Питьевая :: /ХВС/Транспортировка/Питьевая :: /ХВС/Производство/Питьевая",null,null,"31-12-2017 00:00:00","31-12-2017 00:00:00"]
[265,"Республика Башкортостан","Иглинский муниципальный район","80628000","Иглинский сельский совет","80628416","26472155","МУП \"Водоканал\"","0224009480","022401001","Оказание услуг в сфере водоснабжения","Подвоз воды :: Техническая :: Питьевая :: Техническая :: Питьевая :: Техническая :: Питьевая :: Очистка","/ХВС/Подвоз воды :: /ХВС/Сбыт/Техническая :: /ХВС/Сбыт/Питьевая :: /ХВС/Транспортировка/Техническая :: /ХВС/Транспортировка/Питьевая :: /ХВС/Производство/Техническая :: /ХВС/Производство/Питьевая :: /ХВС/Очистка",null,null,"15-01-2010 00:00:00"]
[266,"Республика Башкортостан","Иглинский муниципальный район","80628000","Калтымановский сельский совет","80628420","28876660","МУП \"КАЛТАСИНСКИЕ ТС СП КАЛТАСИНСКИЙ СЕЛЬСОВЕТ МР КАЛТАСИНСКИЙ РАЙОН РБ\"","0227006889","022701001","Оказание услуг в сфере водоснабжения","Питьевая","/ХВС/Производство/Питьевая","28-01-2015 00:00:00",null,"31-03-2016 00:00:00"]
[267,"Республика Башкортостан","Иглинский муниципальный район","80628000","Кудеевский сельский совет","80628432","26472913","ООО \"Коммунальщик\" (Иглинский МР)","0224010750","022401001","Транспортировка воды","Питьевая :: Питьевая :: Питьевая :: Очистка","/ХВС/Сбыт/Питьевая :: /ХВС/Транспортировка/Питьевая :: /ХВС/Производство/Питьевая :: /ХВС/Очистка",null,null,"28-07-2016 00:00:00"]
[268,"Республика Башкортостан","Иглинский муниципальный район","80628000","Кудеевский сельский совет","80628432","26472913","ООО \"Коммунальщик\" (Иглинский МР)","0224010750","022401001","Оказание услуг в сфере водоснабжения","Питьевая :: Питьевая :: Питьевая :: Очистка","/ХВС/Сбыт/Питьевая :: /ХВС/Транспортировка/Питьевая :: /ХВС/Производство/Питьевая :: /ХВС/Очистка",null,null,"28-07-2016 00:00:00"]
[269,"Республика Башкортостан","Иглинский муниципальный район","80628000","Тавтимановский сельский совет","80628455","26812367","Куйбышевская дирекция  по тепловодоснабжению структурное подразделение Центральной дирекции по тепловодоснабжению филиала ПАО «РЖД»","7708503727","631145034","Транспортировка воды","Питьевая :: Питьевая :: Питьевая","/ХВС/Сбыт/Питьевая :: /ХВС/Транспортировка/Питьевая :: /ХВС/Производство/Питьевая",null,null,"31-12-2017 00:00:00","31-12-2017 00:00:00"]
[270,"Республика Башкортостан","Иглинский муниципальный район","80628000","Тавтимановский сельский совет","80628455","26812367","Куйбышевская дирекция  по тепловодоснабжению структурное подразделение Центральной дирекции по тепловодоснабжению филиала ПАО «РЖД»","7708503727","631145034","Оказание услуг в сфере водоснабжения","Питьевая :: Питьевая :: Питьевая","/ХВС/Сбыт/Питьевая :: /ХВС/Транспортировка/Питьевая :: /ХВС/Производство/Питьевая",null,null,"31-12-2017 00:00:00","31-12-2017 00:00:00"]
[271,"Республика Башкортостан","Иглинский муниципальный район","80628000","Улу-Телякский сельский совет","80628472","26812367","Куйбышевская дирекция  по тепловодоснабжению структурное подразделение Центральной дирекции по тепловодоснабжению филиала ПАО «РЖД»","7708503727","631145034","Оказание услуг в сфере водоснабжения","Питьевая :: Питьевая :: Питьевая","/ХВС/Сбыт/Питьевая :: /ХВС/Транспортировка/Питьевая :: /ХВС/Производство/Питьевая",null,null,"31-12-2017 00:00:00","31-12-2017 00:00:00"]
[272,"Республика Башкортостан","Иглинский муниципальный район","80628000","Улу-Телякский сельский совет","80628472","26812367","Куйбышевская дирекция  по тепловодоснабжению структурное подразделение Центральной дирекции по тепловодоснабжению филиала ПАО «РЖД»","7708503727","631145034","Транспортировка воды","Питьевая :: Питьевая :: Питьевая","/ХВС/Сбыт/Питьевая :: /ХВС/Транспортировка/Питьевая :: /ХВС/Производство/Питьевая",null,null,"31-12-2017 00:00:00","31-12-2017 00:00:00"]
[273,"Республика Башкортостан","Иглинский муниципальный район","80628000","Улу-Телякский сельский совет","80628472","26472913","ООО \"Коммунальщик\" (Иглинский МР)","0224010750","022401001","Оказание услуг в сфере водоснабжения","Подвоз воды :: Техническая :: Питьевая :: Техническая :: Питьевая :: Техническая :: Питьевая :: Очистка","/ХВС/Подвоз воды :: /ХВС/Сбыт/Техническая :: /ХВС/Сбыт/Питьевая :: /ХВС/Транспортировка/Техническая :: /ХВС/Транспортировка/Питьевая :: /ХВС/Производство/Техническая :: /ХВС/Производство/Питьевая :: /ХВС/Очистка",null,null,"15-01-2010 00:00:00"]
[274,"Республика Башкортостан","Иглинский муниципальный район","80628000","Урманский сельский совет","80628474","26472913","ООО \"Коммунальщик\" (Иглинский МР)","0224010750","022401001","Оказание услуг в сфере водоснабжения","Техническая :: Техническая :: Техническая :: Очистка","/ХВС/Сбыт/Техническая :: /ХВС/Транспортировка/Техническая :: /ХВС/Производство/Техническая :: /ХВС/Очистка",null,null,"28-07-2016 00:00:00"]
[275,"Республика Башкортостан","Иглинский муниципальный район","80628000","Урманский сельский совет","80628474","26472913","ООО \"Коммунальщик\" (Иглинский МР)","0224010750","022401001","Транспортировка воды","Техническая :: Техническая :: Техническая :: Очистка","/ХВС/Сбыт/Техническая :: /ХВС/Транспортировка/Техническая :: /ХВС/Производство/Техническая :: /ХВС/Очистка",null,null,"28-07-2016 00:00:00"]
[276,"Республика Башкортостан","Илишевский муниципальный район","80630000","Яркеевский сельский совет","80630484","27129164","ООО \"Водолей\" Илишевского района","0225009394","022501001","Оказание услуг в сфере водоснабжения","Подвоз воды :: Техническая :: Питьевая :: Техническая :: Питьевая :: Техническая :: Питьевая :: Очистка","/ХВС/Подвоз воды :: /ХВС/Сбыт/Техническая :: /ХВС/Сбыт/Питьевая :: /ХВС/Транспортировка/Техническая :: /ХВС/Транспортировка/Питьевая :: /ХВС/Производство/Техническая :: /ХВС/Производство/Питьевая :: /ХВС/Очистка",null,null,"15-09-2011 00:00:00"]
[277,"Республика Башкортостан","Ишимбайский муниципальный район","80631000","Город Ишимбай","80631101","26353677","\"Жилищно-коммунальный сервис\" МР Ишимбайский район РБ","0261014150","026101001","Оказание услуг в сфере водоснабжения","Подвоз воды :: Техническая :: Питьевая :: Техническая :: Питьевая :: Техническая :: Питьевая :: Очистка","/ХВС/Подвоз воды :: /ХВС/Сбыт/Техническая :: /ХВС/Сбыт/Питьевая :: /ХВС/Транспортировка/Техническая :: /ХВС/Транспортировка/Питьевая :: /ХВС/Производство/Техническая :: /ХВС/Производство/Питьевая :: /ХВС/Очистка",null,"31-12-2017 00:00:00","15-09-2008 00:00:00","31-12-2017 00:00:00"]
[278,"Республика Башкортостан","Ишимбайский муниципальный район","80631000","Город Ишимбай","80631101","26472050","ИМУП \"Межрайкоммунводоканал\"","0261002348","026101001","Транспортировка воды","Техническая :: Питьевая :: Техническая :: Питьевая :: Техническая :: Питьевая","/ХВС/Сбыт/Техническая :: /ХВС/Сбыт/Питьевая :: /ХВС/Транспортировка/Техническая :: /ХВС/Транспортировка/Питьевая :: /ХВС/Производство/Техническая :: /ХВС/Производство/Питьевая",null,null,"15-01-2010 00:00:00"]
[279,"Республика Башкортостан","Ишимбайский муниципальный район","80631000","Город Ишимбай","80631101","26472050","ИМУП \"Межрайкоммунводоканал\"","0261002348","026101001","Оказание услуг в сфере водоснабжения","Техническая :: Питьевая :: Техническая :: Питьевая :: Техническая :: Питьевая","/ХВС/Сбыт/Техническая :: /ХВС/Сбыт/Питьевая :: /ХВС/Транспортировка/Техническая :: /ХВС/Транспортировка/Питьевая :: /ХВС/Производство/Техническая :: /ХВС/Производство/Питьевая",null,null,"15-01-2010 00:00:00"]
[280,"Республика Башкортостан","Ишимбайский муниципальный район","80631000","Город Ишимбай","80631101","28422092","ООО \"СтройРемСервис+\"","0261019704","026101001","Оказание услуг в сфере водоснабжения","Подвоз воды :: Техническая :: Питьевая :: Техническая :: Питьевая :: Техническая :: Питьевая :: Очистка","/ХВС/Подвоз воды :: /ХВС/Сбыт/Техническая :: /ХВС/Сбыт/Питьевая :: /ХВС/Транспортировка/Техническая :: /ХВС/Транспортировка/Питьевая :: /ХВС/Производство/Техническая :: /ХВС/Производство/Питьевая :: /ХВС/Очистка","24-10-2013 00:00:00",null,"24-10-2013 00:00:00","31-12-2017 00:00:00"]
[281,"Республика Башкортостан","Ишимбайский муниципальный район","80631000","Петровский сельский совет","80631455","28953962","ООО \"БАШЖИЛСТРОЙПРОЕКТ\"","0261020957","026101001","Оказание услуг в сфере водоснабжения","Подвоз воды :: Техническая :: Питьевая :: Техническая :: Питьевая :: Техническая :: Питьевая :: Очистка","/ХВС/Подвоз воды :: /ХВС/Сбыт/Техническая :: /ХВС/Сбыт/Питьевая :: /ХВС/Транспортировка/Техническая :: /ХВС/Транспортировка/Питьевая :: /ХВС/Производство/Техническая :: /ХВС/Производство/Питьевая :: /ХВС/Очистка","15-04-2015 00:00:00",null,"15-04-2015 00:00:00"]
[282,"Республика Башкортостан","Калтасинский муниципальный район","80633000","Калтасинский сельский совет","80633425","28876660","МУП \"КАЛТАСИНСКИЕ ТС СП КАЛТАСИНСКИЙ СЕЛЬСОВЕТ МР КАЛТАСИНСКИЙ РАЙОН РБ\"","0227006889","022701001","Оказание услуг в сфере водоснабжения","Питьевая :: Очистка","/ХВС/Сбыт/Питьевая :: /ХВС/Очистка","28-01-2015 00:00:00",null,"31-03-2016 00:00:00"]
[283,"Республика Башкортостан","Калтасинский муниципальный район","80633000","Калтасинский сельский совет","80633425","26472247","ООО \"Коммунальник\" (Калтасинский МР)","0227006208","022701001","Оказание услуг в сфере водоснабжения","Подвоз воды :: Техническая :: Питьевая :: Техническая :: Питьевая :: Техническая :: Питьевая :: Очистка","/ХВС/Подвоз воды :: /ХВС/Сбыт/Техническая :: /ХВС/Сбыт/Питьевая :: /ХВС/Транспортировка/Техническая :: /ХВС/Транспортировка/Питьевая :: /ХВС/Производство/Техническая :: /ХВС/Производство/Питьевая :: /ХВС/Очистка",null,null,"15-01-2010 00:00:00"]
[284,"Республика Башкортостан","Калтасинский муниципальный район","80633000","Краснохолмский сельский совет","80633447","28814581","МУП \"КРАСНОХОЛМСКИЕ ТС СП КС МР КАЛТАСИНСКИЙ РАЙОН РБ\"","0227038094","022701001","Оказание услуг в сфере водоснабжения","Подвоз воды :: Техническая :: Питьевая :: Техническая :: Питьевая :: Техническая :: Питьевая :: Очистка","/ХВС/Подвоз воды :: /ХВС/Сбыт/Техническая :: /ХВС/Сбыт/Питьевая :: /ХВС/Транспортировка/Техническая :: /ХВС/Транспортировка/Питьевая :: /ХВС/Производство/Техническая :: /ХВС/Производство/Питьевая :: /ХВС/Очистка","18-09-2014 00:00:00",null,"18-09-2014 00:00:00"]
[285,"Республика Башкортостан","Калтасинский муниципальный район","80633000","Краснохолмский сельский совет","80633447","26353631","ООО \"Краснохолмский водоканал\"","0227006695","022701001","Транспортировка воды","Техническая :: Питьевая :: Техническая :: Питьевая :: Техническая :: Питьевая","/ХВС/Сбыт/Техническая :: /ХВС/Сбыт/Питьевая :: /ХВС/Транспортировка/Техническая :: /ХВС/Транспортировка/Питьевая :: /ХВС/Производство/Техническая :: /ХВС/Производство/Питьевая",null,null,"15-09-2008 00:00:00","31-12-2017 00:00:00"]
[286,"Республика Башкортостан","Калтасинский муниципальный район","80633000","Краснохолмский сельский совет","80633447","26353631","ООО \"Краснохолмский водоканал\"","0227006695","022701001","Оказание услуг в сфере водоснабжения","Техническая :: Питьевая :: Техническая :: Питьевая :: Техническая :: Питьевая","/ХВС/Сбыт/Техническая :: /ХВС/Сбыт/Питьевая :: /ХВС/Транспортировка/Техническая :: /ХВС/Транспортировка/Питьевая :: /ХВС/Производство/Техническая :: /ХВС/Производство/Питьевая",null,null,"15-09-2008 00:00:00","31-12-2017 00:00:00"]
[287,"Республика Башкортостан","Караидельский муниципальный район","80634000","Караидельский сельский совет","80634432","26452957","ООО \"Монтаж-сервис\" МР Караидельский район","0228004517","022801001","Оказание услуг в сфере водоснабжения","Подвоз воды :: Техническая :: Питьевая :: Техническая :: Питьевая :: Техническая :: Питьевая :: Очистка","/ХВС/Подвоз воды :: /ХВС/Сбыт/Техническая :: /ХВС/Сбыт/Питьевая :: /ХВС/Транспортировка/Техническая :: /ХВС/Транспортировка/Питьевая :: /ХВС/Производство/Техническая :: /ХВС/Производство/Питьевая :: /ХВС/Очистка",null,null,"10-12-2009 00:00:00"]
[288,"Республика Башкортостан","Кармаскалинский муниципальный район","80635000","Кабаковский сельский совет","80635423","26812367","Куйбышевская дирекция  по тепловодоснабжению структурное подразделение Центральной дирекции по тепловодоснабжению филиала ПАО «РЖД»","7708503727","631145034","Транспортировка воды","Питьевая :: Питьевая :: Питьевая","/ХВС/Сбыт/Питьевая :: /ХВС/Транспортировка/Питьевая :: /ХВС/Производство/Питьевая",null,null,"31-12-2017 00:00:00","31-12-2017 00:00:00"]
[289,"Республика Башкортостан","Кармаскалинский муниципальный район","80635000","Кабаковский сельский совет","80635423","26812367","Куйбышевская дирекция  по тепловодоснабжению структурное подразделение Центральной дирекции по тепловодоснабжению филиала ПАО «РЖД»","7708503727","631145034","Оказание услуг в сфере водоснабжения","Питьевая :: Питьевая :: Питьевая","/ХВС/Сбыт/Питьевая :: /ХВС/Транспортировка/Питьевая :: /ХВС/Производство/Питьевая",null,null,"31-12-2017 00:00:00","31-12-2017 00:00:00"]
[290,"Республика Башкортостан","Кармаскалинский муниципальный район","80635000","Кабаковский сельский совет","80635423","28504502","ООО \"Вектор\"","0229009853","022901001","Оказание услуг в сфере водоснабжения","Подвоз воды :: Техническая :: Питьевая :: Техническая :: Питьевая :: Техническая :: Питьевая :: Очистка","/ХВС/Подвоз воды :: /ХВС/Сбыт/Техническая :: /ХВС/Сбыт/Питьевая :: /ХВС/Транспортировка/Техническая :: /ХВС/Транспортировка/Питьевая :: /ХВС/Производство/Техническая :: /ХВС/Производство/Питьевая :: /ХВС/Очистка","05-05-2014 00:00:00",null,"05-05-2014 00:00:00"]
[291,"Республика Башкортостан","Кармаскалинский муниципальный район","80635000","Камышлинский сельский совет","80635425","26812367","Куйбышевская дирекция  по тепловодоснабжению структурное подразделение Центральной дирекции по тепловодоснабжению филиала ПАО «РЖД»","7708503727","631145034","Транспортировка воды","Питьевая :: Питьевая :: Питьевая","/ХВС/Сбыт/Питьевая :: /ХВС/Транспортировка/Питьевая :: /ХВС/Производство/Питьевая",null,null,"31-12-2017 00:00:00","31-12-2017 00:00:00"]
[292,"Республика Башкортостан","Кармаскалинский муниципальный район","80635000","Камышлинский сельский совет","80635425","26812367","Куйбышевская дирекция  по тепловодоснабжению структурное подразделение Центральной дирекции по тепловодоснабжению филиала ПАО «РЖД»","7708503727","631145034","Оказание услуг в сфере водоснабжения","Питьевая :: Питьевая :: Питьевая","/ХВС/Сбыт/Питьевая :: /ХВС/Транспортировка/Питьевая :: /ХВС/Производство/Питьевая",null,null,"31-12-2017 00:00:00","31-12-2017 00:00:00"]
[293,"Республика Башкортостан","Кармаскалинский муниципальный район","80635000","Карламанский сельский совет","80635430","26453968","ООО \"Стройбытсервис\" МР Кармаскалинский район","0229010601","022901001","Оказание услуг в сфере водоснабжения","Подвоз воды :: Техническая :: Питьевая :: Техническая :: Питьевая :: Техническая :: Питьевая :: Очистка","/ХВС/Подвоз воды :: /ХВС/Сбыт/Техническая :: /ХВС/Сбыт/Питьевая :: /ХВС/Транспортировка/Техническая :: /ХВС/Транспортировка/Питьевая :: /ХВС/Производство/Техническая :: /ХВС/Производство/Питьевая :: /ХВС/Очистка",null,null,"10-12-2009 00:00:00"]
[294,"Республика Башкортостан","Кармаскалинский муниципальный район","80635000","Кармаскалинский сельский совет","80635435","26472379","ООО \"Водоканал\" Кармаскалинский район","0229010697","022901001","Оказание услуг в сфере водоснабжения","Подвоз воды :: Техническая :: Питьевая :: Техническая :: Питьевая :: Техническая :: Питьевая :: Очистка","/ХВС/Подвоз воды :: /ХВС/Сбыт/Техническая :: /ХВС/Сбыт/Питьевая :: /ХВС/Транспортировка/Техническая :: /ХВС/Транспортировка/Питьевая :: /ХВС/Производство/Техническая :: /ХВС/Производство/Питьевая :: /ХВС/Очистка",null,null,"15-01-2010 00:00:00"]
[295,"Республика Башкортостан","Кармаскалинский муниципальный район","80635000","Кармаскалинский сельский совет","80635435","26472295","ООО \"Нептун К\"","0229010263","022901001","Оказание услуг в сфере водоснабжения","Подвоз воды :: Техническая :: Питьевая :: Техническая :: Питьевая :: Техническая :: Питьевая :: Очистка","/ХВС/Подвоз воды :: /ХВС/Сбыт/Техническая :: /ХВС/Сбыт/Питьевая :: /ХВС/Транспортировка/Техническая :: /ХВС/Транспортировка/Питьевая :: /ХВС/Производство/Техническая :: /ХВС/Производство/Питьевая :: /ХВС/Очистка",null,"21-02-2018 00:00:00","15-01-2010 00:00:00","31-12-2017 00:00:00"]
[296,"Республика Башкортостан","Кармаскалинский муниципальный район","80635000","Кармаскалинский сельский совет","80635435","27784795","ООО УК \"Жилищный сервисный центр\"","0229011919","022901001","Оказание услуг в сфере водоснабжения","Подвоз воды :: Техническая :: Питьевая :: Техническая :: Питьевая :: Техническая :: Питьевая :: Очистка","/ХВС/Подвоз воды :: /ХВС/Сбыт/Техническая :: /ХВС/Сбыт/Питьевая :: /ХВС/Транспортировка/Техническая :: /ХВС/Транспортировка/Питьевая :: /ХВС/Производство/Техническая :: /ХВС/Производство/Питьевая :: /ХВС/Очистка",null,"21-02-2018 00:00:00","26-07-2012 00:00:00","31-12-2017 00:00:00"]
[297,"Республика Башкортостан","Кармаскалинский муниципальный район","80635000","Новокиешкинский сельский совет","80635445","26812367","Куйбышевская дирекция  по тепловодоснабжению структурное подразделение Центральной дирекции по тепловодоснабжению филиала ПАО «РЖД»","7708503727","631145034","Оказание услуг в сфере водоснабжения","Питьевая :: Питьевая :: Питьевая","/ХВС/Сбыт/Питьевая :: /ХВС/Транспортировка/Питьевая :: /ХВС/Производство/Питьевая",null,null,"31-12-2017 00:00:00","31-12-2017 00:00:00"]
[298,"Республика Башкортостан","Кармаскалинский муниципальный район","80635000","Новокиешкинский сельский совет","80635445","26812367","Куйбышевская дирекция  по тепловодоснабжению структурное подразделение Центральной дирекции по тепловодоснабжению филиала ПАО «РЖД»","7708503727","631145034","Транспортировка воды","Питьевая :: Питьевая :: Питьевая","/ХВС/Сбыт/Питьевая :: /ХВС/Транспортировка/Питьевая :: /ХВС/Производство/Питьевая",null,null,"31-12-2017 00:00:00","31-12-2017 00:00:00"]
[299,"Республика Башкортостан","Кармаскалинский муниципальный район","80635000","Подлубовский сельский совет","80635450","31158329","ООО УК «Городская служба эксплуатации»","0274936480","027401001","Транспортировка воды","Питьевая :: Питьевая :: Питьевая :: Очистка","/ХВС/Сбыт/Питьевая :: /ХВС/Транспортировка/Питьевая :: /ХВС/Производство/Питьевая :: /ХВС/Очистка","10-07-2018 00:00:00",null,"10-07-2018 00:00:00"]
[300,"Республика Башкортостан","Кармаскалинский муниципальный район","80635000","Подлубовский сельский совет","80635450","31158329","ООО УК «Городская служба эксплуатации»","0274936480","027401001","Оказание услуг в сфере водоснабжения","Питьевая :: Питьевая :: Питьевая :: Очистка","/ХВС/Сбыт/Питьевая :: /ХВС/Транспортировка/Питьевая :: /ХВС/Производство/Питьевая :: /ХВС/Очистка","10-07-2018 00:00:00",null,"10-07-2018 00:00:00"]
[301,"Республика Башкортостан","Кармаскалинский муниципальный район","80635000","Прибельский сельский совет","80635451","26812367","Куйбышевская дирекция  по тепловодоснабжению структурное подразделение Центральной дирекции по тепловодоснабжению филиала ПАО «РЖД»","7708503727","631145034","Оказание услуг в сфере водоснабжения","Питьевая :: Питьевая :: Питьевая","/ХВС/Сбыт/Питьевая :: /ХВС/Транспортировка/Питьевая :: /ХВС/Производство/Питьевая",null,null,"31-12-2017 00:00:00","31-12-2017 00:00:00"]
[302,"Республика Башкортостан","Кармаскалинский муниципальный район","80635000","Прибельский сельский совет","80635451","26812367","Куйбышевская дирекция  по тепловодоснабжению структурное подразделение Центральной дирекции по тепловодоснабжению филиала ПАО «РЖД»","7708503727","631145034","Транспортировка воды","Питьевая :: Питьевая :: Питьевая","/ХВС/Сбыт/Питьевая :: /ХВС/Транспортировка/Питьевая :: /ХВС/Производство/Питьевая",null,null,"31-12-2017 00:00:00","31-12-2017 00:00:00"]
[303,"Республика Башкортостан","Кармаскалинский муниципальный район","80635000","Прибельский сельский совет","80635451","26453971","ООО \"Коммунальник\" с.Прибельский МР Кармаскалинский район РБ","0229012038","022901001","Оказание услуг в сфере водоснабжения","Подвоз воды :: Техническая :: Питьевая :: Техническая :: Питьевая :: Техническая :: Питьевая :: Очистка","/ХВС/Подвоз воды :: /ХВС/Сбыт/Техническая :: /ХВС/Сбыт/Питьевая :: /ХВС/Транспортировка/Техническая :: /ХВС/Транспортировка/Питьевая :: /ХВС/Производство/Техническая :: /ХВС/Производство/Питьевая :: /ХВС/Очистка",null,null,"10-12-2009 00:00:00"]
[304,"Республика Башкортостан","Кармаскалинский муниципальный район","80635000","Савалеевский сельский совет","80635455","26472379","ООО \"Водоканал\" Кармаскалинский район","0229010697","022901001","Оказание услуг в сфере водоснабжения","Подвоз воды :: Техническая :: Питьевая :: Техническая :: Питьевая :: Техническая :: Питьевая :: Очистка","/ХВС/Подвоз воды :: /ХВС/Сбыт/Техническая :: /ХВС/Сбыт/Питьевая :: /ХВС/Транспортировка/Техническая :: /ХВС/Транспортировка/Питьевая :: /ХВС/Производство/Техническая :: /ХВС/Производство/Питьевая :: /ХВС/Очистка",null,null,"15-01-2010 00:00:00"]
[305,"Республика Башкортостан","Кигинский муниципальный район","80636000","Верхнекигинский сельский совет","80636415","27937271","ООО \"Кигиводоканал\"","0230004962","023001001","Оказание услуг в сфере водоснабжения","Подвоз воды :: Техническая :: Питьевая :: Техническая :: Питьевая :: Техническая :: Питьевая :: Очистка","/ХВС/Подвоз воды :: /ХВС/Сбыт/Техническая :: /ХВС/Сбыт/Питьевая :: /ХВС/Транспортировка/Техническая :: /ХВС/Транспортировка/Питьевая :: /ХВС/Производство/Техническая :: /ХВС/Производство/Питьевая :: /ХВС/Очистка",null,null,"02-11-2012 00:00:00"]
[306,"Республика Башкортостан","Краснокамский муниципальный район","80637000","Арлановский сельский совет","80637405","28871722","ООО \"Камводсервис\"","0231008342","023101001","Оказание услуг в сфере водоснабжения","Подвоз воды :: Техническая :: Питьевая :: Техническая :: Питьевая :: Техническая :: Питьевая :: Очистка","/ХВС/Подвоз воды :: /ХВС/Сбыт/Техническая :: /ХВС/Сбыт/Питьевая :: /ХВС/Транспортировка/Техническая :: /ХВС/Транспортировка/Питьевая :: /ХВС/Производство/Техническая :: /ХВС/Производство/Питьевая :: /ХВС/Очистка","19-01-2015 00:00:00",null,"20-10-2016 00:00:00"]
[307,"Республика Башкортостан","Краснокамский муниципальный район","80637000","Кариевский сельский совет","80637410","28871722","ООО \"Камводсервис\"","0231008342","023101001","Оказание услуг в сфере водоснабжения","Подвоз воды :: Техническая :: Питьевая :: Техническая :: Питьевая :: Техническая :: Питьевая :: Очистка","/ХВС/Подвоз воды :: /ХВС/Сбыт/Техническая :: /ХВС/Сбыт/Питьевая :: /ХВС/Транспортировка/Техническая :: /ХВС/Транспортировка/Питьевая :: /ХВС/Производство/Техническая :: /ХВС/Производство/Питьевая :: /ХВС/Очистка","19-01-2015 00:00:00",null,"20-10-2016 00:00:00"]
[308,"Республика Башкортостан","Краснокамский муниципальный район","80637000","Куяновский сельский совет","80637412","26472008","ООО \"Жилкомсервис\"","0231007998","023101001","Оказание услуг в сфере водоснабжения","Подвоз воды :: Техническая :: Питьевая :: Техническая :: Питьевая :: Техническая :: Питьевая :: Очистка","/ХВС/Подвоз воды :: /ХВС/Сбыт/Техническая :: /ХВС/Сбыт/Питьевая :: /ХВС/Транспортировка/Техническая :: /ХВС/Транспортировка/Питьевая :: /ХВС/Производство/Техническая :: /ХВС/Производство/Питьевая :: /ХВС/Очистка",null,null,"15-01-2010 00:00:00","31-12-2017 00:00:00"]
[309,"Республика Башкортостан","Краснокамский муниципальный район","80637000","Куяновский сельский совет","80637412","28871722","ООО \"Камводсервис\"","0231008342","023101001","Оказание услуг в сфере водоснабжения","Подвоз воды :: Техническая :: Питьевая :: Техническая :: Питьевая :: Техническая :: Питьевая :: Очистка","/ХВС/Подвоз воды :: /ХВС/Сбыт/Техническая :: /ХВС/Сбыт/Питьевая :: /ХВС/Транспортировка/Техническая :: /ХВС/Транспортировка/Питьевая :: /ХВС/Производство/Техническая :: /ХВС/Производство/Питьевая :: /ХВС/Очистка","19-01-2015 00:00:00",null,"20-10-2016 00:00:00"]
[310,"Республика Башкортостан","Краснокамский муниципальный район","80637000","Музяковский сельский совет","80637415","28871722","ООО \"Камводсервис\"","0231008342","023101001","Оказание услуг в сфере водоснабжения","Подвоз воды :: Техническая :: Питьевая :: Техническая :: Питьевая :: Техническая :: Питьевая :: Очистка","/ХВС/Подвоз воды :: /ХВС/Сбыт/Техническая :: /ХВС/Сбыт/Питьевая :: /ХВС/Транспортировка/Техническая :: /ХВС/Транспортировка/Питьевая :: /ХВС/Производство/Техническая :: /ХВС/Производство/Питьевая :: /ХВС/Очистка","19-01-2015 00:00:00",null,"20-10-2016 00:00:00"]
[311,"Республика Башкортостан","Краснокамский муниципальный район","80637000","Николо-Березовский сельский совет","80637421","28871722","ООО \"Камводсервис\"","0231008342","023101001","Оказание услуг в сфере водоснабжения","Подвоз воды :: Техническая :: Питьевая :: Техническая :: Питьевая :: Техническая :: Питьевая :: Очистка","/ХВС/Подвоз воды :: /ХВС/Сбыт/Техническая :: /ХВС/Сбыт/Питьевая :: /ХВС/Транспортировка/Техническая :: /ХВС/Транспортировка/Питьевая :: /ХВС/Производство/Техническая :: /ХВС/Производство/Питьевая :: /ХВС/Очистка","19-01-2015 00:00:00",null,"19-01-2015 00:00:00"]
[312,"Республика Башкортостан","Краснокамский муниципальный район","80637000","Никольский сельский совет","80637420","28871722","ООО \"Камводсервис\"","0231008342","023101001","Оказание услуг в сфере водоснабжения","Подвоз воды :: Техническая :: Питьевая :: Техническая :: Питьевая :: Техническая :: Питьевая :: Очистка","/ХВС/Подвоз воды :: /ХВС/Сбыт/Техническая :: /ХВС/Сбыт/Питьевая :: /ХВС/Транспортировка/Техническая :: /ХВС/Транспортировка/Питьевая :: /ХВС/Производство/Техническая :: /ХВС/Производство/Питьевая :: /ХВС/Очистка","19-01-2015 00:00:00",null,"20-10-2016 00:00:00"]
[313,"Республика Башкортостан","Краснокамский муниципальный район","80637000","Новобуринский сельский совет","80637425","26807163","OOO \"Башэнергонефть\"","0265025917","027201001","Транспортировка воды","Питьевая","/ХВС/Транспортировка/Питьевая","12-04-2011 00:00:00",null,"27-01-2016 00:00:00","31-12-2017 00:00:00"]
[314,"Республика Башкортостан","Краснокамский муниципальный район","80637000","Новобуринский сельский совет","80637425","28871722","ООО \"Камводсервис\"","0231008342","023101001","Оказание услуг в сфере водоснабжения","Подвоз воды :: Техническая :: Питьевая :: Техническая :: Питьевая :: Техническая :: Питьевая :: Очистка","/ХВС/Подвоз воды :: /ХВС/Сбыт/Техническая :: /ХВС/Сбыт/Питьевая :: /ХВС/Транспортировка/Техническая :: /ХВС/Транспортировка/Питьевая :: /ХВС/Производство/Техническая :: /ХВС/Производство/Питьевая :: /ХВС/Очистка","19-01-2015 00:00:00",null,"20-10-2016 00:00:00"]
[315,"Республика Башкортостан","Краснокамский муниципальный район","80637000","Новокабановский сельский совет","80637430","28871722","ООО \"Камводсервис\"","0231008342","023101001","Оказание услуг в сфере водоснабжения","Подвоз воды :: Техническая :: Питьевая :: Техническая :: Питьевая :: Техническая :: Питьевая :: Очистка","/ХВС/Подвоз воды :: /ХВС/Сбыт/Техническая :: /ХВС/Сбыт/Питьевая :: /ХВС/Транспортировка/Техническая :: /ХВС/Транспортировка/Питьевая :: /ХВС/Производство/Техническая :: /ХВС/Производство/Питьевая :: /ХВС/Очистка","19-01-2015 00:00:00",null,"20-10-2016 00:00:00"]
[316,"Республика Башкортостан","Краснокамский муниципальный район","80637000","Новокаинлыковский сельский совет","80637435","28871722","ООО \"Камводсервис\"","0231008342","023101001","Оказание услуг в сфере водоснабжения","Подвоз воды :: Техническая :: Питьевая :: Техническая :: Питьевая :: Техническая :: Питьевая :: Очистка","/ХВС/Подвоз воды :: /ХВС/Сбыт/Техническая :: /ХВС/Сбыт/Питьевая :: /ХВС/Транспортировка/Техническая :: /ХВС/Транспортировка/Питьевая :: /ХВС/Производство/Техническая :: /ХВС/Производство/Питьевая :: /ХВС/Очистка","19-01-2015 00:00:00",null,"20-10-2016 00:00:00"]
[317,"Республика Башкортостан","Краснокамский муниципальный район","80637000","Новонагаевский сельский совет","80637440","28871722","ООО \"Камводсервис\"","0231008342","023101001","Оказание услуг в сфере водоснабжения","Подвоз воды :: Техническая :: Питьевая :: Техническая :: Питьевая :: Техническая :: Питьевая :: Очистка","/ХВС/Подвоз воды :: /ХВС/Сбыт/Техническая :: /ХВС/Сбыт/Питьевая :: /ХВС/Транспортировка/Техническая :: /ХВС/Транспортировка/Питьевая :: /ХВС/Производство/Техническая :: /ХВС/Производство/Питьевая :: /ХВС/Очистка","19-01-2015 00:00:00",null,"20-10-2016 00:00:00"]
[318,"Республика Башкортостан","Краснокамский муниципальный район","80637000","Новоянзигитовский сельский совет","80637461","28871722","ООО \"Камводсервис\"","0231008342","023101001","Оказание услуг в сфере водоснабжения","Подвоз воды :: Техническая :: Питьевая :: Техническая :: Питьевая :: Техническая :: Питьевая :: Очистка","/ХВС/Подвоз воды :: /ХВС/Сбыт/Техническая :: /ХВС/Сбыт/Питьевая :: /ХВС/Транспортировка/Техническая :: /ХВС/Транспортировка/Питьевая :: /ХВС/Производство/Техническая :: /ХВС/Производство/Питьевая :: /ХВС/Очистка","19-01-2015 00:00:00",null,"20-10-2016 00:00:00"]
[319,"Республика Башкортостан","Краснокамский муниципальный район","80637000","Раздольевский сельский совет","80637443","28871722","ООО \"Камводсервис\"","0231008342","023101001","Оказание услуг в сфере водоснабжения","Подвоз воды :: Техническая :: Питьевая :: Техническая :: Питьевая :: Техническая :: Питьевая :: Очистка","/ХВС/Подвоз воды :: /ХВС/Сбыт/Техническая :: /ХВС/Сбыт/Питьевая :: /ХВС/Транспортировка/Техническая :: /ХВС/Транспортировка/Питьевая :: /ХВС/Производство/Техническая :: /ХВС/Производство/Питьевая :: /ХВС/Очистка","19-01-2015 00:00:00",null,"20-10-2016 00:00:00"]
[320,"Республика Башкортостан","Краснокамский муниципальный район","80637000","Саузбашевский сельский совет","80637450","28871722","ООО \"Камводсервис\"","0231008342","023101001","Оказание услуг в сфере водоснабжения","Подвоз воды :: Техническая :: Питьевая :: Техническая :: Питьевая :: Техническая :: Питьевая :: Очистка","/ХВС/Подвоз воды :: /ХВС/Сбыт/Техническая :: /ХВС/Сбыт/Питьевая :: /ХВС/Транспортировка/Техническая :: /ХВС/Транспортировка/Питьевая :: /ХВС/Производство/Техническая :: /ХВС/Производство/Питьевая :: /ХВС/Очистка","19-01-2015 00:00:00",null,"20-10-2016 00:00:00"]
[321,"Республика Башкортостан","Краснокамский муниципальный район","80637000","Шушнурский сельский совет","80637465","28871722","ООО \"Камводсервис\"","0231008342","023101001","Оказание услуг в сфере водоснабжения","Подвоз воды :: Техническая :: Питьевая :: Техническая :: Питьевая :: Техническая :: Питьевая :: Очистка","/ХВС/Подвоз воды :: /ХВС/Сбыт/Техническая :: /ХВС/Сбыт/Питьевая :: /ХВС/Транспортировка/Техническая :: /ХВС/Транспортировка/Питьевая :: /ХВС/Производство/Техническая :: /ХВС/Производство/Питьевая :: /ХВС/Очистка","19-01-2015 00:00:00",null,"20-10-2016 00:00:00"]
[322,"Республика Башкортостан","Кугарчинский муниципальный район","80638000","Кугарчинский сельский совет","80638440","26472393","ООО \"Водоканал+Сервис\"","0232006965","023201001","Оказание услуг в сфере водоснабжения","Подвоз воды :: Техническая :: Питьевая :: Техническая :: Питьевая :: Техническая :: Питьевая :: Очистка","/ХВС/Подвоз воды :: /ХВС/Сбыт/Техническая :: /ХВС/Сбыт/Питьевая :: /ХВС/Транспортировка/Техническая :: /ХВС/Транспортировка/Питьевая :: /ХВС/Производство/Техническая :: /ХВС/Производство/Питьевая :: /ХВС/Очистка",null,null,"15-01-2010 00:00:00","31-12-2017 00:00:00"]
[323,"Республика Башкортостан","Кугарчинский муниципальный район","80638000","Максютовский сельский совет","80638445","26472391","МУП \"Водоканал\"Кугарчинский","0232002329","023201001","Оказание услуг в сфере водоснабжения","Подвоз воды :: Техническая :: Питьевая :: Техническая :: Питьевая :: Техническая :: Питьевая :: Очистка","/ХВС/Подвоз воды :: /ХВС/Сбыт/Техническая :: /ХВС/Сбыт/Питьевая :: /ХВС/Транспортировка/Техническая :: /ХВС/Транспортировка/Питьевая :: /ХВС/Производство/Техническая :: /ХВС/Производство/Питьевая :: /ХВС/Очистка",null,null,"01-03-2015 00:00:00","31-12-2017 00:00:00"]
[324,"Республика Башкортостан","Кугарчинский муниципальный район","80638000","Мраковский сельский совет","80638450","26472391","МУП \"Водоканал\"Кугарчинский","0232002329","023201001","Оказание услуг в сфере водоснабжения","Подвоз воды :: Техническая :: Питьевая :: Техническая :: Питьевая :: Техническая :: Питьевая :: Очистка","/ХВС/Подвоз воды :: /ХВС/Сбыт/Техническая :: /ХВС/Сбыт/Питьевая :: /ХВС/Транспортировка/Техническая :: /ХВС/Транспортировка/Питьевая :: /ХВС/Производство/Техническая :: /ХВС/Производство/Питьевая :: /ХВС/Очистка",null,null,"15-01-2010 00:00:00"]
[325,"Республика Башкортостан","Кугарчинский муниципальный район","80638000","Мраковский сельский совет","80638450","31076863","МУП \"Центр коммунального развития и благоустройства\"","0232010496","023201001","Транспортировка воды","Питьевая :: Питьевая :: Питьевая","/ХВС/Сбыт/Питьевая :: /ХВС/Транспортировка/Питьевая :: /ХВС/Производство/Питьевая","10-04-2018 00:00:00",null,"10-04-2018 00:00:00"]
[326,"Республика Башкортостан","Кугарчинский муниципальный район","80638000","Мраковский сельский совет","80638450","31076863","МУП \"Центр коммунального развития и благоустройства\"","0232010496","023201001","Оказание услуг в сфере водоснабжения","Питьевая :: Питьевая :: Питьевая","/ХВС/Сбыт/Питьевая :: /ХВС/Транспортировка/Питьевая :: /ХВС/Производство/Питьевая","10-04-2018 00:00:00",null,"10-04-2018 00:00:00"]
[327,"Республика Башкортостан","Кугарчинский муниципальный район","80638000","Мраковский сельский совет","80638450","26841421","Туймазинское нефтепроводное управление - филиал АО \"Транснефть-Урал\"","0278039018","026902001","Оказание услуг в сфере водоснабжения","Питьевая :: Питьевая :: Питьевая :: Очистка","/ХВС/Сбыт/Питьевая :: /ХВС/Транспортировка/Питьевая :: /ХВС/Производство/Питьевая :: /ХВС/Очистка",null,null,"10-08-2017 00:00:00"]
[328,"Республика Башкортостан","Кугарчинский муниципальный район","80638000","Мраковский сельский совет","80638450","26841421","Туймазинское нефтепроводное управление - филиал АО \"Транснефть-Урал\"","0278039018","026902001","Транспортировка воды","Питьевая :: Питьевая :: Питьевая :: Очистка","/ХВС/Сбыт/Питьевая :: /ХВС/Транспортировка/Питьевая :: /ХВС/Производство/Питьевая :: /ХВС/Очистка",null,null,"10-08-2017 00:00:00"]
[329,"Республика Башкортостан","Кугарчинский муниципальный район","80638000","Юмагузинский сельский совет","80638487","26651635","МУП \"Юмагузинский расчетный центр\"","0232007006","023201001","Оказание услуг в сфере водоснабжения","Подвоз воды :: Техническая :: Питьевая :: Техническая :: Питьевая :: Техническая :: Питьевая :: Очистка","/ХВС/Подвоз воды :: /ХВС/Сбыт/Техническая :: /ХВС/Сбыт/Питьевая :: /ХВС/Транспортировка/Техническая :: /ХВС/Транспортировка/Питьевая :: /ХВС/Производство/Техническая :: /ХВС/Производство/Питьевая :: /ХВС/Очистка",null,null,"19-01-2011 00:00:00"]
[330,"Республика Башкортостан","Кушнаренковский муниципальный район","80640000","Карача-Елгинский сельский совет","80640430","28978522","МУП \"Кумэк\" сельского поселения Карача-Елгинский сельский совет МР Кушнаренковский район РБ","0234006713","023401001","Оказание услуг в сфере водоснабжения","Подвоз воды :: Техническая :: Питьевая :: Техническая :: Питьевая :: Техническая :: Питьевая :: Очистка","/ХВС/Подвоз воды :: /ХВС/Сбыт/Техническая :: /ХВС/Сбыт/Питьевая :: /ХВС/Транспортировка/Техническая :: /ХВС/Транспортировка/Питьевая :: /ХВС/Производство/Техническая :: /ХВС/Производство/Питьевая :: /ХВС/Очистка","23-06-2015 00:00:00",null,"15-01-2016 00:00:00"]
[331,"Республика Башкортостан","Кушнаренковский муниципальный район","80640000","Кушнаренковский сельский совет","80640435","28489188","МУП \"Кушнаренковское ЖКХ\" РБ","0234008260","023401001","Оказание услуг в сфере водоснабжения","Подвоз воды :: Техническая :: Питьевая :: Техническая :: Питьевая :: Техническая :: Питьевая :: Очистка","/ХВС/Подвоз воды :: /ХВС/Сбыт/Техническая :: /ХВС/Сбыт/Питьевая :: /ХВС/Транспортировка/Техническая :: /ХВС/Транспортировка/Питьевая :: /ХВС/Производство/Техническая :: /ХВС/Производство/Питьевая :: /ХВС/Очистка","03-03-2014 00:00:00",null,"03-03-2014 00:00:00"]
[332,"Республика Башкортостан","Куюргазинский муниципальный район","80639000","Ермолаевский сельский совет","80639412","26812367","Куйбышевская дирекция  по тепловодоснабжению структурное подразделение Центральной дирекции по тепловодоснабжению филиала ПАО «РЖД»","7708503727","631145034","Оказание услуг в сфере водоснабжения","Питьевая :: Питьевая :: Питьевая","/ХВС/Сбыт/Питьевая :: /ХВС/Транспортировка/Питьевая :: /ХВС/Производство/Питьевая",null,null,"31-12-2017 00:00:00","31-12-2017 00:00:00"]
[333,"Республика Башкортостан","Куюргазинский муниципальный район","80639000","Ермолаевский сельский совет","80639412","26812367","Куйбышевская дирекция  по тепловодоснабжению структурное подразделение Центральной дирекции по тепловодоснабжению филиала ПАО «РЖД»","7708503727","631145034","Транспортировка воды","Питьевая :: Питьевая :: Питьевая","/ХВС/Сбыт/Питьевая :: /ХВС/Транспортировка/Питьевая :: /ХВС/Производство/Питьевая",null,null,"31-12-2017 00:00:00","31-12-2017 00:00:00"]
[334,"Республика Башкортостан","Куюргазинский муниципальный район","80639000","Ермолаевский сельский совет","80639412","26353639","ООО \"Коммунальник\" Куюргазинский МР","0233006220","023301001","Оказание услуг в сфере водоснабжения","Подвоз воды :: Техническая :: Питьевая :: Техническая :: Питьевая :: Техническая :: Питьевая :: Очистка","/ХВС/Подвоз воды :: /ХВС/Сбыт/Техническая :: /ХВС/Сбыт/Питьевая :: /ХВС/Транспортировка/Техническая :: /ХВС/Транспортировка/Питьевая :: /ХВС/Производство/Техническая :: /ХВС/Производство/Питьевая :: /ХВС/Очистка",null,null,"15-09-2008 00:00:00"]
[335,"Республика Башкортостан","Куюргазинский муниципальный район","80639000","Илькинеевский сельский совет","80639415","26812367","Куйбышевская дирекция  по тепловодоснабжению структурное подразделение Центральной дирекции по тепловодоснабжению филиала ПАО «РЖД»","7708503727","631145034","Оказание услуг в сфере водоснабжения","Питьевая :: Питьевая :: Питьевая","/ХВС/Сбыт/Питьевая :: /ХВС/Транспортировка/Питьевая :: /ХВС/Производство/Питьевая",null,null,"31-12-2017 00:00:00","31-12-2017 00:00:00"]
[336,"Республика Башкортостан","Куюргазинский муниципальный район","80639000","Илькинеевский сельский совет","80639415","26812367","Куйбышевская дирекция  по тепловодоснабжению структурное подразделение Центральной дирекции по тепловодоснабжению филиала ПАО «РЖД»","7708503727","631145034","Транспортировка воды","Питьевая :: Питьевая :: Питьевая","/ХВС/Сбыт/Питьевая :: /ХВС/Транспортировка/Питьевая :: /ХВС/Производство/Питьевая",null,null,"31-12-2017 00:00:00","31-12-2017 00:00:00"]
[337,"Республика Башкортостан","Куюргазинский муниципальный район","80639000","Мурапталовский сельский совет","80639435","26812367","Куйбышевская дирекция  по тепловодоснабжению структурное подразделение Центральной дирекции по тепловодоснабжению филиала ПАО «РЖД»","7708503727","631145034","Оказание услуг в сфере водоснабжения","Питьевая :: Питьевая :: Питьевая","/ХВС/Сбыт/Питьевая :: /ХВС/Транспортировка/Питьевая :: /ХВС/Производство/Питьевая",null,null,"31-12-2017 00:00:00","31-12-2017 00:00:00"]
[338,"Республика Башкортостан","Куюргазинский муниципальный район","80639000","Мурапталовский сельский совет","80639435","26812367","Куйбышевская дирекция  по тепловодоснабжению структурное подразделение Центральной дирекции по тепловодоснабжению филиала ПАО «РЖД»","7708503727","631145034","Транспортировка воды","Питьевая :: Питьевая :: Питьевая","/ХВС/Сбыт/Питьевая :: /ХВС/Транспортировка/Питьевая :: /ХВС/Производство/Питьевая",null,null,"31-12-2017 00:00:00","31-12-2017 00:00:00"]
[339,"Республика Башкортостан","Мелеузовский муниципальный район","80641000","Город Мелеуз","80641101","27588602","АО «ЭКОЛАЙН»","0263012052","026301001","Оказание услуг в сфере водоснабжения","Подвоз воды :: Техническая :: Питьевая :: Техническая :: Питьевая :: Техническая :: Питьевая :: Очистка","/ХВС/Подвоз воды :: /ХВС/Сбыт/Техническая :: /ХВС/Сбыт/Питьевая :: /ХВС/Транспортировка/Техническая :: /ХВС/Транспортировка/Питьевая :: /ХВС/Производство/Техническая :: /ХВС/Производство/Питьевая :: /ХВС/Очистка",null,null,"23-01-2012 00:00:00","31-12-2017 00:00:00"]
[340,"Республика Башкортостан","Мелеузовский муниципальный район","80641000","Город Мелеуз","80641101","26353680","ЗАО \"Мелеузовский молочноконсервный комбинат\"","0263002008","026301001","Оказание услуг в сфере водоснабжения","Подвоз воды :: Питьевая :: Питьевая :: Питьевая :: Очистка","/ХВС/Подвоз воды :: /ХВС/Сбыт/Питьевая :: /ХВС/Транспортировка/Питьевая :: /ХВС/Производство/Питьевая :: /ХВС/Очистка",null,null,"15-09-2008 00:00:00"]
[341,"Республика Башкортостан","Мелеузовский муниципальный район","80641000","Город Мелеуз","80641101","26812367","Куйбышевская дирекция  по тепловодоснабжению структурное подразделение Центральной дирекции по тепловодоснабжению филиала ПАО «РЖД»","7708503727","631145034","Оказание услуг в сфере водоснабжения","Питьевая :: Питьевая :: Питьевая","/ХВС/Сбыт/Питьевая :: /ХВС/Транспортировка/Питьевая :: /ХВС/Производство/Питьевая",null,null,"31-12-2017 00:00:00","31-12-2017 00:00:00"]
[342,"Республика Башкортостан","Мелеузовский муниципальный район","80641000","Город Мелеуз","80641101","26812367","Куйбышевская дирекция  по тепловодоснабжению структурное подразделение Центральной дирекции по тепловодоснабжению филиала ПАО «РЖД»","7708503727","631145034","Транспортировка воды","Питьевая :: Питьевая :: Питьевая","/ХВС/Сбыт/Питьевая :: /ХВС/Транспортировка/Питьевая :: /ХВС/Производство/Питьевая",null,null,"31-12-2017 00:00:00","31-12-2017 00:00:00"]
[343,"Республика Башкортостан","Мелеузовский муниципальный район","80641000","Город Мелеуз","80641101","26472406","ОАО «Водоканал»","0263014363","026301001","Оказание услуг в сфере водоснабжения","Подвоз воды :: Техническая :: Питьевая :: Техническая :: Питьевая :: Техническая :: Питьевая :: Очистка","/ХВС/Подвоз воды :: /ХВС/Сбыт/Техническая :: /ХВС/Сбыт/Питьевая :: /ХВС/Транспортировка/Техническая :: /ХВС/Транспортировка/Питьевая :: /ХВС/Производство/Техническая :: /ХВС/Производство/Питьевая :: /ХВС/Очистка",null,null,"15-01-2010 00:00:00","31-12-2017 00:00:00"]
[344,"Республика Башкортостан","Мелеузовский муниципальный район","80641000","Город Мелеуз","80641101","30376832","ООО \"Водоканал\"","0263017332","026301001","Оказание услуг в сфере водоснабжения","Питьевая :: Питьевая :: Питьевая :: Очистка","/ХВС/Сбыт/Питьевая :: /ХВС/Транспортировка/Питьевая :: /ХВС/Производство/Питьевая :: /ХВС/Очистка","09-12-2015 00:00:00",null,"08-07-2016 00:00:00"]
[345,"Республика Башкортостан","Мелеузовский муниципальный район","80641000","Город Мелеуз","80641101","30376832","ООО \"Водоканал\"","0263017332","026301001","Транспортировка воды","Питьевая :: Питьевая :: Питьевая :: Очистка","/ХВС/Сбыт/Питьевая :: /ХВС/Транспортировка/Питьевая :: /ХВС/Производство/Питьевая :: /ХВС/Очистка","09-12-2015 00:00:00",null,"08-07-2016 00:00:00"]
[346,"Республика Башкортостан","Мелеузовский муниципальный район","80641000","Город Мелеуз","80641101","28942977","ООО \"Мелеузовский кирпичный завод\"","0263011387","026301001","Транспортировка воды","Техническая :: Техническая :: Техническая","/ХВС/Сбыт/Техническая :: /ХВС/Транспортировка/Техническая :: /ХВС/Производство/Техническая","20-03-2015 00:00:00",null,"20-03-2015 00:00:00"]
[347,"Республика Башкортостан","Мелеузовский муниципальный район","80641000","Город Мелеуз","80641101","28942977","ООО \"Мелеузовский кирпичный завод\"","0263011387","026301001","Оказание услуг в сфере водоснабжения","Техническая :: Техническая :: Техническая","/ХВС/Сбыт/Техническая :: /ХВС/Транспортировка/Техническая :: /ХВС/Производство/Техническая","20-03-2015 00:00:00",null,"20-03-2015 00:00:00"]
[348,"Республика Башкортостан","Мелеузовский муниципальный район","80641000","Город Мелеуз","80641101","30982937","ООО \"Эколайн\"","0263024530","026301001","Оказание услуг в сфере водоснабжения","Подвоз воды :: Техническая :: Питьевая :: Техническая :: Питьевая :: Техническая :: Питьевая :: Очистка","/ХВС/Подвоз воды :: /ХВС/Сбыт/Техническая :: /ХВС/Сбыт/Питьевая :: /ХВС/Транспортировка/Техническая :: /ХВС/Транспортировка/Питьевая :: /ХВС/Производство/Техническая :: /ХВС/Производство/Питьевая :: /ХВС/Очистка","17-10-2017 00:00:00",null,"17-10-2017 00:00:00"]
[349,"Республика Башкортостан","Мелеузовский муниципальный район","80641000","Зирганский сельский совет","80641430","26812367","Куйбышевская дирекция  по тепловодоснабжению структурное подразделение Центральной дирекции по тепловодоснабжению филиала ПАО «РЖД»","7708503727","631145034","Оказание услуг в сфере водоснабжения","Питьевая :: Питьевая :: Питьевая","/ХВС/Сбыт/Питьевая :: /ХВС/Транспортировка/Питьевая :: /ХВС/Производство/Питьевая",null,null,"31-12-2017 00:00:00","31-12-2017 00:00:00"]
[350,"Республика Башкортостан","Мелеузовский муниципальный район","80641000","Зирганский сельский совет","80641430","26812367","Куйбышевская дирекция  по тепловодоснабжению структурное подразделение Центральной дирекции по тепловодоснабжению филиала ПАО «РЖД»","7708503727","631145034","Транспортировка воды","Питьевая :: Питьевая :: Питьевая","/ХВС/Сбыт/Питьевая :: /ХВС/Транспортировка/Питьевая :: /ХВС/Производство/Питьевая",null,null,"31-12-2017 00:00:00","31-12-2017 00:00:00"]
[351,"Республика Башкортостан","Мелеузовский муниципальный район","80641000","Мелеузовский сельский совет","80641450","26812367","Куйбышевская дирекция  по тепловодоснабжению структурное подразделение Центральной дирекции по тепловодоснабжению филиала ПАО «РЖД»","7708503727","631145034","Оказание услуг в сфере водоснабжения","Питьевая :: Питьевая :: Питьевая","/ХВС/Сбыт/Питьевая :: /ХВС/Транспортировка/Питьевая :: /ХВС/Производство/Питьевая",null,null,"31-12-2017 00:00:00","31-12-2017 00:00:00"]
[352,"Республика Башкортостан","Мелеузовский муниципальный район","80641000","Мелеузовский сельский совет","80641450","26812367","Куйбышевская дирекция  по тепловодоснабжению структурное подразделение Центральной дирекции по тепловодоснабжению филиала ПАО «РЖД»","7708503727","631145034","Транспортировка воды","Питьевая :: Питьевая :: Питьевая","/ХВС/Сбыт/Питьевая :: /ХВС/Транспортировка/Питьевая :: /ХВС/Производство/Питьевая",null,null,"31-12-2017 00:00:00","31-12-2017 00:00:00"]
[353,"Республика Башкортостан","Мечетлинский муниципальный район","80642000","Большеустьикинский сельский совет","80642415","26353640","ООО \"Тепловик\" Мечетлинского района РБ","0236005440","023601001","Оказание услуг в сфере водоснабжения","Подвоз воды :: Техническая :: Питьевая :: Техническая :: Питьевая :: Техническая :: Питьевая :: Очистка","/ХВС/Подвоз воды :: /ХВС/Сбыт/Техническая :: /ХВС/Сбыт/Питьевая :: /ХВС/Транспортировка/Техническая :: /ХВС/Транспортировка/Питьевая :: /ХВС/Производство/Техническая :: /ХВС/Производство/Питьевая :: /ХВС/Очистка",null,null,"15-09-2008 00:00:00"]
[354,"Республика Башкортостан","Мечетлинский муниципальный район","80642000","Дуван-Мечетлинский сельский совет","80642420","26472412","ООО \"Мечетлинский водоканал\"","0236005391","023601001","Оказание услуг в сфере водоснабжения","Подвоз воды :: Техническая :: Питьевая :: Техническая :: Питьевая :: Техническая :: Питьевая :: Очистка","/ХВС/Подвоз воды :: /ХВС/Сбыт/Техническая :: /ХВС/Сбыт/Питьевая :: /ХВС/Транспортировка/Техническая :: /ХВС/Транспортировка/Питьевая :: /ХВС/Производство/Техническая :: /ХВС/Производство/Питьевая :: /ХВС/Очистка",null,null,"15-01-2010 00:00:00","31-12-2017 00:00:00"]
[355,"Республика Башкортостан","Мишкинский муниципальный район","80643000","Мишкинский сельский совет","80643450","26353641","ООО \"ПЖКХ Мишкинское\"","0237003950","023701001","Оказание услуг в сфере водоснабжения","Подвоз воды :: Техническая :: Питьевая :: Техническая :: Питьевая :: Техническая :: Питьевая :: Очистка","/ХВС/Подвоз воды :: /ХВС/Сбыт/Техническая :: /ХВС/Сбыт/Питьевая :: /ХВС/Транспортировка/Техническая :: /ХВС/Транспортировка/Питьевая :: /ХВС/Производство/Техническая :: /ХВС/Производство/Питьевая :: /ХВС/Очистка",null,null,"15-09-2008 00:00:00"]
[356,"Республика Башкортостан","Миякинский муниципальный район","80644000","Миякинский сельский совет","80644450","26472419","ООО \"Мияки - коммунальный сервис\"","0238005407","023801001","Оказание услуг в сфере водоснабжения","Подвоз воды :: Техническая :: Питьевая :: Техническая :: Питьевая :: Техническая :: Питьевая :: Очистка","/ХВС/Подвоз воды :: /ХВС/Сбыт/Техническая :: /ХВС/Сбыт/Питьевая :: /ХВС/Транспортировка/Техническая :: /ХВС/Транспортировка/Питьевая :: /ХВС/Производство/Техническая :: /ХВС/Производство/Питьевая :: /ХВС/Очистка",null,null,"15-01-2010 00:00:00"]
[357,"Республика Башкортостан","Миякинский муниципальный район","80644000","Миякинский сельский совет","80644450","26761494","ООО Айсушишма","0238005439","023801001","Оказание услуг в сфере водоснабжения","Подвоз воды :: Техническая :: Питьевая :: Техническая :: Питьевая :: Техническая :: Питьевая :: Очистка","/ХВС/Подвоз воды :: /ХВС/Сбыт/Техническая :: /ХВС/Сбыт/Питьевая :: /ХВС/Транспортировка/Техническая :: /ХВС/Транспортировка/Питьевая :: /ХВС/Производство/Техническая :: /ХВС/Производство/Питьевая :: /ХВС/Очистка",null,null,"02-02-2011 00:00:00"]
[358,"Республика Башкортостан","Миякинский муниципальный район","80644000","Новокарамалинский сельский совет","80644460","28488902","СХПК им. Крупской Миякинский р-н","0238000695","023801001","Оказание услуг в сфере водоснабжения","Подвоз воды :: Техническая :: Питьевая :: Техническая :: Питьевая :: Техническая :: Питьевая :: Очистка","/ХВС/Подвоз воды :: /ХВС/Сбыт/Техническая :: /ХВС/Сбыт/Питьевая :: /ХВС/Транспортировка/Техническая :: /ХВС/Транспортировка/Питьевая :: /ХВС/Производство/Техническая :: /ХВС/Производство/Питьевая :: /ХВС/Очистка","28-02-2014 00:00:00",null,"28-02-2014 00:00:00"]
[359,"Республика Башкортостан","Нуримановский муниципальный район","80645000","Красногорский сельский совет","80645415","26353644","ООО «Нуримановское ЖКХ»","0239005216","023901001","Транспортировка воды","Техническая :: Питьевая :: Техническая :: Питьевая :: Техническая :: Питьевая","/ХВС/Сбыт/Техническая :: /ХВС/Сбыт/Питьевая :: /ХВС/Транспортировка/Техническая :: /ХВС/Транспортировка/Питьевая :: /ХВС/Производство/Техническая :: /ХВС/Производство/Питьевая",null,null,"15-09-2008 00:00:00"]
[360,"Республика Башкортостан","Нуримановский муниципальный район","80645000","Красногорский сельский совет","80645415","26353644","ООО «Нуримановское ЖКХ»","0239005216","023901001","Оказание услуг в сфере водоснабжения","Техническая :: Питьевая :: Техническая :: Питьевая :: Техническая :: Питьевая","/ХВС/Сбыт/Техническая :: /ХВС/Сбыт/Питьевая :: /ХВС/Транспортировка/Техническая :: /ХВС/Транспортировка/Питьевая :: /ХВС/Производство/Техническая :: /ХВС/Производство/Питьевая",null,null,"15-09-2008 00:00:00"]
[361,"Республика Башкортостан","Нуримановский муниципальный район","80645000","Красноключевский сельский совет","80645416","30953201","Муниципальное унитарное предприятие жилищно-коммунального хозяйства муниципального района Нуримановский район Республики Башкортостан","0239000200","023901001","Оказание услуг в сфере водоснабжения","Техническая :: Питьевая :: Техническая :: Питьевая :: Техническая :: Питьевая :: Очистка","/ХВС/Сбыт/Техническая :: /ХВС/Сбыт/Питьевая :: /ХВС/Транспортировка/Техническая :: /ХВС/Транспортировка/Питьевая :: /ХВС/Производство/Техническая :: /ХВС/Производство/Питьевая :: /ХВС/Очистка",null,null,"21-09-2017 00:00:00"]
[362,"Республика Башкортостан","Нуримановский муниципальный район","80645000","Красноключевский сельский совет","80645416","30953201","Муниципальное унитарное предприятие жилищно-коммунального хозяйства муниципального района Нуримановский район Республики Башкортостан","0239000200","023901001","Транспортировка воды","Техническая :: Питьевая :: Техническая :: Питьевая :: Техническая :: Питьевая :: Очистка","/ХВС/Сбыт/Техническая :: /ХВС/Сбыт/Питьевая :: /ХВС/Транспортировка/Техническая :: /ХВС/Транспортировка/Питьевая :: /ХВС/Производство/Техническая :: /ХВС/Производство/Питьевая :: /ХВС/Очистка",null,null,"21-09-2017 00:00:00"]
[363,"Республика Башкортостан","Нуримановский муниципальный район","80645000","Павловский сельский совет","80645444","30953201","Муниципальное унитарное предприятие жилищно-коммунального хозяйства муниципального района Нуримановский район Республики Башкортостан","0239000200","023901001","Транспортировка воды","Техническая :: Питьевая :: Техническая :: Питьевая :: Техническая :: Питьевая :: Очистка","/ХВС/Сбыт/Техническая :: /ХВС/Сбыт/Питьевая :: /ХВС/Транспортировка/Техническая :: /ХВС/Транспортировка/Питьевая :: /ХВС/Производство/Техническая :: /ХВС/Производство/Питьевая :: /ХВС/Очистка",null,null,"21-09-2017 00:00:00"]
[364,"Республика Башкортостан","Нуримановский муниципальный район","80645000","Павловский сельский совет","80645444","30953201","Муниципальное унитарное предприятие жилищно-коммунального хозяйства муниципального района Нуримановский район Республики Башкортостан","0239000200","023901001","Оказание услуг в сфере водоснабжения","Техническая :: Питьевая :: Техническая :: Питьевая :: Техническая :: Питьевая :: Очистка","/ХВС/Сбыт/Техническая :: /ХВС/Сбыт/Питьевая :: /ХВС/Транспортировка/Техническая :: /ХВС/Транспортировка/Питьевая :: /ХВС/Производство/Техническая :: /ХВС/Производство/Питьевая :: /ХВС/Очистка",null,null,"21-09-2017 00:00:00"]
[365,"Республика Башкортостан","Нуримановский муниципальный район","80645000","Павловский сельский совет","80645444","28950884","ООО \"ПАВЛОВКА-ВОДОКАНАЛ\"","0239005978","023901001","Оказание услуг в сфере водоснабжения","Подвоз воды :: Техническая :: Питьевая :: Техническая :: Питьевая :: Техническая :: Питьевая :: Очистка","/ХВС/Подвоз воды :: /ХВС/Сбыт/Техническая :: /ХВС/Сбыт/Питьевая :: /ХВС/Транспортировка/Техническая :: /ХВС/Транспортировка/Питьевая :: /ХВС/Производство/Техническая :: /ХВС/Производство/Питьевая :: /ХВС/Очистка","31-03-2015 00:00:00",null,"31-03-2015 00:00:00","01-11-2017 00:00:00"]
[366,"Республика Башкортостан","Нуримановский муниципальный район","80645000","Павловский сельский совет","80645444","27946617","ООО \"Павловка Водоканал Сервис\"","0239005689","023901001","Оказание услуг в сфере водоснабжения","Подвоз воды :: Техническая :: Питьевая :: Техническая :: Питьевая :: Техническая :: Питьевая :: Очистка","/ХВС/Подвоз воды :: /ХВС/Сбыт/Техническая :: /ХВС/Сбыт/Питьевая :: /ХВС/Транспортировка/Техническая :: /ХВС/Транспортировка/Питьевая :: /ХВС/Производство/Техническая :: /ХВС/Производство/Питьевая :: /ХВС/Очистка","08-11-2012 00:00:00",null,"08-11-2012 00:00:00","31-12-2017 00:00:00"]
[367,"Республика Башкортостан","Салаватский муниципальный район","80647000","Аркауловский сельский совет","80647410","30914679","ИП Гайнетдинов Н.Х.","024001014623","отсутствует","Оказание услуг в сфере водоснабжения","Подвоз воды :: Техническая :: Питьевая :: Техническая :: Питьевая :: Техническая :: Питьевая :: Очистка","/ХВС/Подвоз воды :: /ХВС/Сбыт/Техническая :: /ХВС/Сбыт/Питьевая :: /ХВС/Транспортировка/Техническая :: /ХВС/Транспортировка/Питьевая :: /ХВС/Производство/Техническая :: /ХВС/Производство/Питьевая :: /ХВС/Очистка",null,null,"16-05-2017 00:00:00"]
[368,"Республика Башкортостан","Салаватский муниципальный район","80647000","Аркауловский сельский совет","80647410","26472442","ООО \"Комсельсервис\"","0240006285","024001001","Оказание услуг в сфере водоснабжения","Подвоз воды :: Техническая :: Питьевая :: Техническая :: Питьевая :: Техническая :: Питьевая :: Очистка","/ХВС/Подвоз воды :: /ХВС/Сбыт/Техническая :: /ХВС/Сбыт/Питьевая :: /ХВС/Транспортировка/Техническая :: /ХВС/Транспортировка/Питьевая :: /ХВС/Производство/Техническая :: /ХВС/Производство/Питьевая :: /ХВС/Очистка",null,"16-05-2017 00:00:00","15-01-2010 00:00:00","16-05-2017 00:00:00"]
[369,"Республика Башкортостан","Салаватский муниципальный район","80647000","Мещегаровский сельский совет","80647445","30917978","ООО \"Водолей\" Салаватский район","0240019943","024001001","Оказание услуг в сфере водоснабжения","Техническая :: Питьевая :: Техническая :: Питьевая :: Техническая :: Питьевая :: Очистка","/ХВС/Сбыт/Техническая :: /ХВС/Сбыт/Питьевая :: /ХВС/Транспортировка/Техническая :: /ХВС/Транспортировка/Питьевая :: /ХВС/Производство/Техническая :: /ХВС/Производство/Питьевая :: /ХВС/Очистка","29-05-2017 00:00:00",null,"29-05-2017 00:00:00"]
[370,"Республика Башкортостан","Салаватский муниципальный район","80647000","Мещегаровский сельский совет","80647445","30917978","ООО \"Водолей\" Салаватский район","0240019943","024001001","Транспортировка воды","Техническая :: Питьевая :: Техническая :: Питьевая :: Техническая :: Питьевая :: Очистка","/ХВС/Сбыт/Техническая :: /ХВС/Сбыт/Питьевая :: /ХВС/Транспортировка/Техническая :: /ХВС/Транспортировка/Питьевая :: /ХВС/Производство/Техническая :: /ХВС/Производство/Питьевая :: /ХВС/Очистка","29-05-2017 00:00:00",null,"29-05-2017 00:00:00"]
[371,"Республика Башкортостан","Салаватский муниципальный район","80647000","Мурсалимкинский сельский совет","80647447","31064984","ООО \"Гранит\"","0240006920","024001001","Транспортировка воды","Питьевая :: Питьевая :: Питьевая","/ХВС/Сбыт/Питьевая :: /ХВС/Транспортировка/Питьевая :: /ХВС/Производство/Питьевая","29-03-2018 00:00:00",null,"29-03-2018 00:00:00"]
[372,"Республика Башкортостан","Салаватский муниципальный район","80647000","Мурсалимкинский сельский совет","80647447","31064984","ООО \"Гранит\"","0240006920","024001001","Оказание услуг в сфере водоснабжения","Питьевая :: Питьевая :: Питьевая","/ХВС/Сбыт/Питьевая :: /ХВС/Транспортировка/Питьевая :: /ХВС/Производство/Питьевая","29-03-2018 00:00:00",null,"29-03-2018 00:00:00"]
[373,"Республика Башкортостан","Салаватский муниципальный район","80647000","Мурсалимкинский сельский совет","80647447","27634723","ООО \"Тепловодоканал\" Салаватский район","0240000389","024001001","Оказание услуг в сфере водоснабжения","Подвоз воды :: Техническая :: Питьевая :: Техническая :: Питьевая :: Техническая :: Питьевая :: Очистка","/ХВС/Подвоз воды :: /ХВС/Сбыт/Техническая :: /ХВС/Сбыт/Питьевая :: /ХВС/Транспортировка/Техническая :: /ХВС/Транспортировка/Питьевая :: /ХВС/Производство/Техническая :: /ХВС/Производство/Питьевая :: /ХВС/Очистка","28-02-2012 00:00:00",null,"28-02-2012 00:00:00","31-12-2017 00:00:00"]
[374,"Республика Башкортостан","Салаватский муниципальный район","80647000","Мурсалимкинский сельский совет","80647447","26360992","Южно-Уральская дирекция по тепловодоснабжению - структурное подразделение Центральной дирекции по тепловодоснабжению - филиала ОАО \"РЖД\"","7708503727","744945004","Оказание услуг в сфере водоснабжения","Подвоз воды :: Питьевая :: Питьевая :: Питьевая :: Очистка","/ХВС/Подвоз воды :: /ХВС/Сбыт/Питьевая :: /ХВС/Транспортировка/Питьевая :: /ХВС/Производство/Питьевая :: /ХВС/Очистка","23-09-2003 00:00:00",null,"18-10-2016 00:00:00"]
[375,"Республика Башкортостан","Салаватский муниципальный район","80647000","Салаватский сельский совет","80647453","26454029","ООО \"Коммунальщик\" Салаватский район","0240804502","024001001","Оказание услуг в сфере водоснабжения","Подвоз воды :: Техническая :: Питьевая :: Техническая :: Питьевая :: Техническая :: Питьевая :: Очистка","/ХВС/Подвоз воды :: /ХВС/Сбыт/Техническая :: /ХВС/Сбыт/Питьевая :: /ХВС/Транспортировка/Техническая :: /ХВС/Транспортировка/Питьевая :: /ХВС/Производство/Техническая :: /ХВС/Производство/Питьевая :: /ХВС/Очистка",null,null,"16-12-2016 00:00:00"]
[376,"Республика Башкортостан","Салаватский муниципальный район","80647000","Янгантауский сельский совет","80647475","30942188","АО Санаторий \"Янган-Тау\"","0240007225","024001001","Транспортировка воды","Техническая :: Питьевая :: Техническая :: Питьевая :: Техническая :: Питьевая","/ХВС/Сбыт/Техническая :: /ХВС/Сбыт/Питьевая :: /ХВС/Транспортировка/Техническая :: /ХВС/Транспортировка/Питьевая :: /ХВС/Производство/Техническая :: /ХВС/Производство/Питьевая","15-08-2017 00:00:00",null,"15-08-2017 00:00:00"]
[377,"Республика Башкортостан","Салаватский муниципальный район","80647000","Янгантауский сельский совет","80647475","30942188","АО Санаторий \"Янган-Тау\"","0240007225","024001001","Оказание услуг в сфере водоснабжения","Техническая :: Питьевая :: Техническая :: Питьевая :: Техническая :: Питьевая","/ХВС/Сбыт/Техническая :: /ХВС/Сбыт/Питьевая :: /ХВС/Транспортировка/Техническая :: /ХВС/Транспортировка/Питьевая :: /ХВС/Производство/Техническая :: /ХВС/Производство/Питьевая","15-08-2017 00:00:00",null,"15-08-2017 00:00:00"]
[378,"Республика Башкортостан","Салаватский муниципальный район","80647000","Янгантауский сельский совет","80647475","27958466","ГУП санаторий \"Янган-Тау\"","0240000558","024001001","Транспортировка воды","Техническая :: Питьевая :: Техническая :: Питьевая :: Техническая :: Питьевая","/ХВС/Сбыт/Техническая :: /ХВС/Сбыт/Питьевая :: /ХВС/Транспортировка/Техническая :: /ХВС/Транспортировка/Питьевая :: /ХВС/Производство/Техническая :: /ХВС/Производство/Питьевая","15-11-2012 00:00:00",null,"15-11-2012 00:00:00","31-12-2017 00:00:00"]
[379,"Республика Башкортостан","Салаватский муниципальный район","80647000","Янгантауский сельский совет","80647475","27958466","ГУП санаторий \"Янган-Тау\"","0240000558","024001001","Оказание услуг в сфере водоснабжения","Техническая :: Питьевая :: Техническая :: Питьевая :: Техническая :: Питьевая","/ХВС/Сбыт/Техническая :: /ХВС/Сбыт/Питьевая :: /ХВС/Транспортировка/Техническая :: /ХВС/Транспортировка/Питьевая :: /ХВС/Производство/Техническая :: /ХВС/Производство/Питьевая","15-11-2012 00:00:00",null,"15-11-2012 00:00:00","31-12-2017 00:00:00"]
[380,"Республика Башкортостан","Стерлибашевский муниципальный район","80648000","Стерлибашевский сельский совет","80648445","26472448","ООО \"Стерлибашевоводоканал\"","0241004555","024101001","Оказание услуг в сфере водоснабжения","Подвоз воды :: Техническая :: Питьевая :: Техническая :: Питьевая :: Техническая :: Питьевая :: Очистка","/ХВС/Подвоз воды :: /ХВС/Сбыт/Техническая :: /ХВС/Сбыт/Питьевая :: /ХВС/Транспортировка/Техническая :: /ХВС/Транспортировка/Питьевая :: /ХВС/Производство/Техническая :: /ХВС/Производство/Питьевая :: /ХВС/Очистка",null,null,"15-01-2010 00:00:00"]
[381,"Республика Башкортостан","Стерлитамакский муниципальный район","80649000","Алатанинский сельский совет","80649412","26766191","ООО \"УК ЖКХ\"","0242007975","024201001","Оказание услуг в сфере водоснабжения","Подвоз воды :: Техническая :: Питьевая :: Техническая :: Питьевая :: Техническая :: Питьевая :: Очистка","/ХВС/Подвоз воды :: /ХВС/Сбыт/Техническая :: /ХВС/Сбыт/Питьевая :: /ХВС/Транспортировка/Техническая :: /ХВС/Транспортировка/Питьевая :: /ХВС/Производство/Техническая :: /ХВС/Производство/Питьевая :: /ХВС/Очистка",null,null,"29-08-2016 00:00:00"]
[382,"Республика Башкортостан","Стерлитамакский муниципальный район","80649000","Буриказгановский сельский совет","80649428","30873518","ИП Богданов Ф.В.","024200897282","отсутствует","Транспортировка воды","Питьевая :: Питьевая :: Питьевая :: Очистка","/ХВС/Сбыт/Питьевая :: /ХВС/Транспортировка/Питьевая :: /ХВС/Производство/Питьевая :: /ХВС/Очистка","24-01-2017 00:00:00",null,"24-01-2017 00:00:00"]
[383,"Республика Башкортостан","Стерлитамакский муниципальный район","80649000","Буриказгановский сельский совет","80649428","30873518","ИП Богданов Ф.В.","024200897282","отсутствует","Оказание услуг в сфере водоснабжения","Питьевая :: Питьевая :: Питьевая :: Очистка","/ХВС/Сбыт/Питьевая :: /ХВС/Транспортировка/Питьевая :: /ХВС/Производство/Питьевая :: /ХВС/Очистка","24-01-2017 00:00:00",null,"24-01-2017 00:00:00"]
[384,"Республика Башкортостан","Стерлитамакский муниципальный район","80649000","Красноярский сельский совет","80649444","26812367","Куйбышевская дирекция  по тепловодоснабжению структурное подразделение Центральной дирекции по тепловодоснабжению филиала ПАО «РЖД»","7708503727","631145034","Транспортировка воды","Питьевая :: Питьевая :: Питьевая","/ХВС/Сбыт/Питьевая :: /ХВС/Транспортировка/Питьевая :: /ХВС/Производство/Питьевая",null,null,"31-12-2017 00:00:00","31-12-2017 00:00:00"]
[385,"Республика Башкортостан","Стерлитамакский муниципальный район","80649000","Красноярский сельский совет","80649444","26812367","Куйбышевская дирекция  по тепловодоснабжению структурное подразделение Центральной дирекции по тепловодоснабжению филиала ПАО «РЖД»","7708503727","631145034","Оказание услуг в сфере водоснабжения","Питьевая :: Питьевая :: Питьевая","/ХВС/Сбыт/Питьевая :: /ХВС/Транспортировка/Питьевая :: /ХВС/Производство/Питьевая",null,null,"31-12-2017 00:00:00","31-12-2017 00:00:00"]
[386,"Республика Башкортостан","Стерлитамакский муниципальный район","80649000","Куганакский сельский совет","80649440","26766191","ООО \"УК ЖКХ\"","0242007975","024201001","Оказание услуг в сфере водоснабжения","Подвоз воды :: Техническая :: Питьевая :: Техническая :: Питьевая :: Техническая :: Питьевая :: Очистка","/ХВС/Подвоз воды :: /ХВС/Сбыт/Техническая :: /ХВС/Сбыт/Питьевая :: /ХВС/Транспортировка/Техническая :: /ХВС/Транспортировка/Питьевая :: /ХВС/Производство/Техническая :: /ХВС/Производство/Питьевая :: /ХВС/Очистка",null,null,"29-08-2016 00:00:00"]
[387,"Республика Башкортостан","Стерлитамакский муниципальный район","80649000","Наумовский сельский совет","80649448","26812367","Куйбышевская дирекция  по тепловодоснабжению структурное подразделение Центральной дирекции по тепловодоснабжению филиала ПАО «РЖД»","7708503727","631145034","Оказание услуг в сфере водоснабжения","Питьевая :: Питьевая :: Питьевая","/ХВС/Сбыт/Питьевая :: /ХВС/Транспортировка/Питьевая :: /ХВС/Производство/Питьевая",null,null,"31-12-2017 00:00:00","31-12-2017 00:00:00"]
[388,"Республика Башкортостан","Стерлитамакский муниципальный район","80649000","Наумовский сельский совет","80649448","26812367","Куйбышевская дирекция  по тепловодоснабжению структурное подразделение Центральной дирекции по тепловодоснабжению филиала ПАО «РЖД»","7708503727","631145034","Транспортировка воды","Питьевая :: Питьевая :: Питьевая","/ХВС/Сбыт/Питьевая :: /ХВС/Транспортировка/Питьевая :: /ХВС/Производство/Питьевая",null,null,"31-12-2017 00:00:00","31-12-2017 00:00:00"]
[389,"Республика Башкортостан","Стерлитамакский муниципальный район","80649000","Октябрьский сельский совет","80649460","30880207","ООО \"Водолей\"","0242010199","024201001","Транспортировка воды","Питьевая :: Питьевая :: Питьевая :: Очистка","/ХВС/Сбыт/Питьевая :: /ХВС/Транспортировка/Питьевая :: /ХВС/Производство/Питьевая :: /ХВС/Очистка","08-02-2017 00:00:00",null,"08-02-2017 00:00:00"]
[390,"Республика Башкортостан","Стерлитамакский муниципальный район","80649000","Октябрьский сельский совет","80649460","30880207","ООО \"Водолей\"","0242010199","024201001","Оказание услуг в сфере водоснабжения","Питьевая :: Питьевая :: Питьевая :: Очистка","/ХВС/Сбыт/Питьевая :: /ХВС/Транспортировка/Питьевая :: /ХВС/Производство/Питьевая :: /ХВС/Очистка","08-02-2017 00:00:00",null,"08-02-2017 00:00:00"]
[391,"Республика Башкортостан","Стерлитамакский муниципальный район","80649000","Отрадовский сельский совет","80649456","28068181","ООО \"Водоканал\" Стерлитамакский район","0242009732","024201001","Оказание услуг в сфере водоснабжения","Подвоз воды :: Техническая :: Питьевая :: Техническая :: Питьевая :: Техническая :: Питьевая :: Очистка","/ХВС/Подвоз воды :: /ХВС/Сбыт/Техническая :: /ХВС/Сбыт/Питьевая :: /ХВС/Транспортировка/Техническая :: /ХВС/Транспортировка/Питьевая :: /ХВС/Производство/Техническая :: /ХВС/Производство/Питьевая :: /ХВС/Очистка","28-01-2013 00:00:00","21-02-2018 00:00:00","28-01-2013 00:00:00","31-12-2017 00:00:00"]
[392,"Республика Башкортостан","Стерлитамакский муниципальный район","80649000","Рощинский сельский совет","80649478","26353647","ГУСП  совхоз \"Рощинский\"","0242001148","024201001","Оказание услуг в сфере водоснабжения","Подвоз воды :: Техническая :: Питьевая :: Техническая :: Питьевая :: Техническая :: Питьевая :: Очистка","/ХВС/Подвоз воды :: /ХВС/Сбыт/Техническая :: /ХВС/Сбыт/Питьевая :: /ХВС/Транспортировка/Техническая :: /ХВС/Транспортировка/Питьевая :: /ХВС/Производство/Техническая :: /ХВС/Производство/Питьевая :: /ХВС/Очистка",null,null,"15-09-2008 00:00:00"]
[393,"Республика Башкортостан","Стерлитамакский муниципальный район","80649000","Рощинский сельский совет","80649478","26766191","ООО \"УК ЖКХ\"","0242007975","024201001","Оказание услуг в сфере водоснабжения","Подвоз воды :: Техническая :: Питьевая :: Техническая :: Питьевая :: Техническая :: Питьевая :: Очистка","/ХВС/Подвоз воды :: /ХВС/Сбыт/Техническая :: /ХВС/Сбыт/Питьевая :: /ХВС/Транспортировка/Техническая :: /ХВС/Транспортировка/Питьевая :: /ХВС/Производство/Техническая :: /ХВС/Производство/Питьевая :: /ХВС/Очистка",null,null,"29-08-2016 00:00:00"]
[394,"Республика Башкортостан","Татышлинский муниципальный район","80650000","Верхнетатышлинский сельский совет","80650425","26454086","ООО \"Комсервис\" МР Татышлинский район РБ","0243003927","024301001","Оказание услуг в сфере водоснабжения","Подвоз воды :: Техническая :: Питьевая :: Техническая :: Питьевая :: Техническая :: Питьевая :: Очистка","/ХВС/Подвоз воды :: /ХВС/Сбыт/Техническая :: /ХВС/Сбыт/Питьевая :: /ХВС/Транспортировка/Техническая :: /ХВС/Транспортировка/Питьевая :: /ХВС/Производство/Техническая :: /ХВС/Производство/Питьевая :: /ХВС/Очистка",null,null,"10-12-2009 00:00:00"]
[395,"Республика Башкортостан","Туймазинский муниципальный район","80651000","Город Туймазы","80651101","31020528","ООО \"Водоканал г. Туймазы\"","0269036490","026901001","Оказание услуг в сфере водоснабжения","Подвоз воды :: Техническая :: Питьевая :: Техническая :: Питьевая :: Техническая :: Питьевая :: Очистка","/ХВС/Подвоз воды :: /ХВС/Сбыт/Техническая :: /ХВС/Сбыт/Питьевая :: /ХВС/Транспортировка/Техническая :: /ХВС/Транспортировка/Питьевая :: /ХВС/Производство/Техническая :: /ХВС/Производство/Питьевая :: /ХВС/Очистка","28-12-2017 00:00:00",null,"28-12-2017 00:00:00","21-02-2018 00:00:00"]
[396,"Республика Башкортостан","Туймазинский муниципальный район","80651000","Город Туймазы","80651101","26472450","ООО \"Туймазыводоканал\"","0269030971","026901001","Транспортировка воды","Техническая :: Питьевая :: Техническая :: Питьевая :: Техническая :: Питьевая","/ХВС/Сбыт/Техническая :: /ХВС/Сбыт/Питьевая :: /ХВС/Транспортировка/Техническая :: /ХВС/Транспортировка/Питьевая :: /ХВС/Производство/Техническая :: /ХВС/Производство/Питьевая",null,null,"15-01-2010 00:00:00"]
[397,"Республика Башкортостан","Туймазинский муниципальный район","80651000","Город Туймазы","80651101","26472450","ООО \"Туймазыводоканал\"","0269030971","026901001","Оказание услуг в сфере водоснабжения","Техническая :: Питьевая :: Техническая :: Питьевая :: Техническая :: Питьевая","/ХВС/Сбыт/Техническая :: /ХВС/Сбыт/Питьевая :: /ХВС/Транспортировка/Техническая :: /ХВС/Транспортировка/Питьевая :: /ХВС/Производство/Техническая :: /ХВС/Производство/Питьевая",null,null,"15-01-2010 00:00:00"]
[398,"Республика Башкортостан","Туймазинский муниципальный район","80651000","Кандринский сельский совет","80651427","26812367","Куйбышевская дирекция  по тепловодоснабжению структурное подразделение Центральной дирекции по тепловодоснабжению филиала ПАО «РЖД»","7708503727","631145034","Оказание услуг в сфере водоснабжения","Питьевая :: Питьевая :: Питьевая","/ХВС/Сбыт/Питьевая :: /ХВС/Транспортировка/Питьевая :: /ХВС/Производство/Питьевая",null,null,"31-12-2017 00:00:00","31-12-2017 00:00:00"]
[399,"Республика Башкортостан","Туймазинский муниципальный район","80651000","Кандринский сельский совет","80651427","26812367","Куйбышевская дирекция  по тепловодоснабжению структурное подразделение Центральной дирекции по тепловодоснабжению филиала ПАО «РЖД»","7708503727","631145034","Транспортировка воды","Питьевая :: Питьевая :: Питьевая","/ХВС/Сбыт/Питьевая :: /ХВС/Транспортировка/Питьевая :: /ХВС/Производство/Питьевая",null,null,"31-12-2017 00:00:00","31-12-2017 00:00:00"]
[400,"Республика Башкортостан","Туймазинский муниципальный район","80651000","Кандринский сельский совет","80651427","31076837","ООО \"Водоканал с. Серафимовский\"","0269998106","026901001","Транспортировка воды","Питьевая :: Питьевая :: Питьевая","/ХВС/Сбыт/Питьевая :: /ХВС/Транспортировка/Питьевая :: /ХВС/Производство/Питьевая","10-04-2018 00:00:00",null,"10-04-2018 00:00:00"]
[401,"Республика Башкортостан","Туймазинский муниципальный район","80651000","Кандринский сельский совет","80651427","31076837","ООО \"Водоканал с. Серафимовский\"","0269998106","026901001","Оказание услуг в сфере водоснабжения","Питьевая :: Питьевая :: Питьевая","/ХВС/Сбыт/Питьевая :: /ХВС/Транспортировка/Питьевая :: /ХВС/Производство/Питьевая","10-04-2018 00:00:00",null,"10-04-2018 00:00:00"]
[402,"Республика Башкортостан","Туймазинский муниципальный район","80651000","Нижнетроицкий сельский совет","80651439","31076837","ООО \"Водоканал с. Серафимовский\"","0269998106","026901001","Оказание услуг в сфере водоснабжения","Питьевая :: Питьевая :: Питьевая","/ХВС/Сбыт/Питьевая :: /ХВС/Транспортировка/Питьевая :: /ХВС/Производство/Питьевая","10-04-2018 00:00:00",null,"10-04-2018 00:00:00"]
[403,"Республика Башкортостан","Туймазинский муниципальный район","80651000","Нижнетроицкий сельский совет","80651439","31076837","ООО \"Водоканал с. Серафимовский\"","0269998106","026901001","Транспортировка воды","Питьевая :: Питьевая :: Питьевая","/ХВС/Сбыт/Питьевая :: /ХВС/Транспортировка/Питьевая :: /ХВС/Производство/Питьевая","10-04-2018 00:00:00",null,"10-04-2018 00:00:00"]
[404,"Республика Башкортостан","Туймазинский муниципальный район","80651000","Серафимовский сельский совет","80651447","31076837","ООО \"Водоканал с. Серафимовский\"","0269998106","026901001","Транспортировка воды","Питьевая :: Питьевая :: Питьевая","/ХВС/Сбыт/Питьевая :: /ХВС/Транспортировка/Питьевая :: /ХВС/Производство/Питьевая","10-04-2018 00:00:00",null,"10-04-2018 00:00:00"]
[405,"Республика Башкортостан","Туймазинский муниципальный район","80651000","Серафимовский сельский совет","80651447","31076837","ООО \"Водоканал с. Серафимовский\"","0269998106","026901001","Оказание услуг в сфере водоснабжения","Питьевая :: Питьевая :: Питьевая","/ХВС/Сбыт/Питьевая :: /ХВС/Транспортировка/Питьевая :: /ХВС/Производство/Питьевая","10-04-2018 00:00:00",null,"10-04-2018 00:00:00"]
[406,"Республика Башкортостан","Туймазинский муниципальный район","80651000","Субханкуловский сельский совет","80651461","26472452","ООО УПТК \"Водомонтажкомплект\"","0269019015","026901001","Оказание услуг в сфере водоснабжения","Подвоз воды :: Техническая :: Питьевая :: Техническая :: Питьевая :: Техническая :: Питьевая :: Очистка","/ХВС/Подвоз воды :: /ХВС/Сбыт/Техническая :: /ХВС/Сбыт/Питьевая :: /ХВС/Транспортировка/Техническая :: /ХВС/Транспортировка/Питьевая :: /ХВС/Производство/Техническая :: /ХВС/Производство/Питьевая :: /ХВС/Очистка",null,null,"15-01-2010 00:00:00"]
[407,"Республика Башкортостан","Туймазинский муниципальный район","80651000","Субханкуловский сельский совет","80651461","26841421","Туймазинское нефтепроводное управление - филиал АО \"Транснефть-Урал\"","0278039018","026902001","Оказание услуг в сфере водоснабжения","Подвоз воды :: Техническая :: Питьевая :: Техническая :: Питьевая :: Техническая :: Питьевая :: Очистка","/ХВС/Подвоз воды :: /ХВС/Сбыт/Техническая :: /ХВС/Сбыт/Питьевая :: /ХВС/Транспортировка/Техническая :: /ХВС/Транспортировка/Питьевая :: /ХВС/Производство/Техническая :: /ХВС/Производство/Питьевая :: /ХВС/Очистка",null,null,"15-06-2011 00:00:00"]
[408,"Республика Башкортостан","Уфимский муниципальный район","80652000","Авдонский сельский совет","80652405","26353704","ООО КХ \"Авдон\"","0245019658","024501001","Оказание услуг в сфере водоснабжения","Подвоз воды :: Техническая :: Питьевая :: Техническая :: Питьевая :: Техническая :: Питьевая :: Очистка","/ХВС/Подвоз воды :: /ХВС/Сбыт/Техническая :: /ХВС/Сбыт/Питьевая :: /ХВС/Транспортировка/Техническая :: /ХВС/Транспортировка/Питьевая :: /ХВС/Производство/Техническая :: /ХВС/Производство/Питьевая :: /ХВС/Очистка",null,null,"15-09-2008 00:00:00"]
[409,"Республика Башкортостан","Уфимский муниципальный район","80652000","Алексеевский сельский совет","80652403","26760341","ГУСП совхоз «Алексеевский» РБ","0245004926","024501001","Оказание услуг в сфере водоснабжения","Подвоз воды :: Техническая :: Питьевая :: Техническая :: Питьевая :: Техническая :: Питьевая :: Очистка","/ХВС/Подвоз воды :: /ХВС/Сбыт/Техническая :: /ХВС/Сбыт/Питьевая :: /ХВС/Транспортировка/Техническая :: /ХВС/Транспортировка/Питьевая :: /ХВС/Производство/Техническая :: /ХВС/Производство/Питьевая :: /ХВС/Очистка",null,null,"01-02-2011 00:00:00"]
[410,"Республика Башкортостан","Уфимский муниципальный район","80652000","Алексеевский сельский совет","80652403","26353710","ООО\"Алексеевское коммунальное управление\" МР Уфимский район РБ","0245019753","024501001","Оказание услуг в сфере водоснабжения","Подвоз воды :: Техническая :: Питьевая :: Техническая :: Питьевая :: Техническая :: Питьевая :: Очистка","/ХВС/Подвоз воды :: /ХВС/Сбыт/Техническая :: /ХВС/Сбыт/Питьевая :: /ХВС/Транспортировка/Техническая :: /ХВС/Транспортировка/Питьевая :: /ХВС/Производство/Техническая :: /ХВС/Производство/Питьевая :: /ХВС/Очистка",null,null,"15-09-2008 00:00:00"]
[411,"Республика Башкортостан","Уфимский муниципальный район","80652000","Булгаковский сельский совет","80652410","26353700","АО \" Международный аэропорт \"Уфа\"","0274108180","024501001","Оказание услуг в сфере водоснабжения","Подвоз воды :: Техническая :: Питьевая :: Техническая :: Питьевая :: Техническая :: Питьевая :: Очистка","/ХВС/Подвоз воды :: /ХВС/Сбыт/Техническая :: /ХВС/Сбыт/Питьевая :: /ХВС/Транспортировка/Техническая :: /ХВС/Транспортировка/Питьевая :: /ХВС/Производство/Техническая :: /ХВС/Производство/Питьевая :: /ХВС/Очистка","01-01-2012 00:00:00",null,"01-01-2012 00:00:00"]
[412,"Республика Башкортостан","Уфимский муниципальный район","80652000","Булгаковский сельский совет","80652410","26454242","ООО ЖКХ \"Шемяк\"","0245021015","024501001","Оказание услуг в сфере водоснабжения","Подвоз воды :: Техническая :: Питьевая :: Техническая :: Питьевая :: Техническая :: Питьевая :: Очистка","/ХВС/Подвоз воды :: /ХВС/Сбыт/Техническая :: /ХВС/Сбыт/Питьевая :: /ХВС/Транспортировка/Техническая :: /ХВС/Транспортировка/Питьевая :: /ХВС/Производство/Техническая :: /ХВС/Производство/Питьевая :: /ХВС/Очистка",null,null,"10-12-2009 00:00:00"]
[413,"Республика Башкортостан","Уфимский муниципальный район","80652000","Булгаковский сельский совет","80652410","28486251","ООО УК \"НовоБулгаково\"","0245025010","024501001","Оказание услуг в сфере водоснабжения","Подвоз воды :: Техническая :: Питьевая :: Техническая :: Питьевая :: Техническая :: Питьевая :: Очистка","/ХВС/Подвоз воды :: /ХВС/Сбыт/Техническая :: /ХВС/Сбыт/Питьевая :: /ХВС/Транспортировка/Техническая :: /ХВС/Транспортировка/Питьевая :: /ХВС/Производство/Техническая :: /ХВС/Производство/Питьевая :: /ХВС/Очистка","20-02-2014 00:00:00",null,"20-02-2014 00:00:00"]
[414,"Республика Башкортостан","Уфимский муниципальный район","80652000","Дмитриевский сельский совет","80652415","26454236","ООО \"Стройресурсы\"","0245019785","024501001","Оказание услуг в сфере водоснабжения","Подвоз воды :: Техническая :: Питьевая :: Техническая :: Питьевая :: Техническая :: Питьевая :: Очистка","/ХВС/Подвоз воды :: /ХВС/Сбыт/Техническая :: /ХВС/Сбыт/Питьевая :: /ХВС/Транспортировка/Техническая :: /ХВС/Транспортировка/Питьевая :: /ХВС/Производство/Техническая :: /ХВС/Производство/Питьевая :: /ХВС/Очистка",null,null,"10-12-2009 00:00:00"]
[415,"Республика Башкортостан","Уфимский муниципальный район","80652000","Жуковский сельский совет","80652418","26353704","ООО КХ \"Авдон\"","0245019658","024501001","Оказание услуг в сфере водоснабжения","Подвоз воды :: Техническая :: Питьевая :: Техническая :: Питьевая :: Техническая :: Питьевая :: Очистка","/ХВС/Подвоз воды :: /ХВС/Сбыт/Техническая :: /ХВС/Сбыт/Питьевая :: /ХВС/Транспортировка/Техническая :: /ХВС/Транспортировка/Питьевая :: /ХВС/Производство/Техническая :: /ХВС/Производство/Питьевая :: /ХВС/Очистка",null,null,"24-02-2016 00:00:00"]
[416,"Республика Башкортостан","Уфимский муниципальный район","80652000","Зубовский сельский совет","80652420","26454242","ООО ЖКХ \"Шемяк\"","0245021015","024501001","Оказание услуг в сфере водоснабжения","Подвоз воды :: Техническая :: Питьевая :: Техническая :: Питьевая :: Техническая :: Питьевая :: Очистка","/ХВС/Подвоз воды :: /ХВС/Сбыт/Техническая :: /ХВС/Сбыт/Питьевая :: /ХВС/Транспортировка/Техническая :: /ХВС/Транспортировка/Питьевая :: /ХВС/Производство/Техническая :: /ХВС/Производство/Питьевая :: /ХВС/Очистка",null,null,"12-07-2016 00:00:00"]
[417,"Республика Башкортостан","Уфимский муниципальный район","80652000","Зубовский сельский совет","80652420","26651697","ООО ПЖУ \"Нижегородское\"","0245012420","024501001","Оказание услуг в сфере водоснабжения","Подвоз воды :: Техническая :: Питьевая :: Техническая :: Питьевая :: Техническая :: Питьевая :: Очистка","/ХВС/Подвоз воды :: /ХВС/Сбыт/Техническая :: /ХВС/Сбыт/Питьевая :: /ХВС/Транспортировка/Техническая :: /ХВС/Транспортировка/Питьевая :: /ХВС/Производство/Техническая :: /ХВС/Производство/Питьевая :: /ХВС/Очистка",null,null,"19-01-2011 00:00:00"]
[418,"Республика Башкортостан","Уфимский муниципальный район","80652000","Кармасанский сельский совет","80652423","26454236","ООО \"Стройресурсы\"","0245019785","024501001","Оказание услуг в сфере водоснабжения","Подвоз воды :: Техническая :: Техническая :: Техническая :: Очистка","/ХВС/Подвоз воды :: /ХВС/Сбыт/Техническая :: /ХВС/Транспортировка/Техническая :: /ХВС/Производство/Техническая :: /ХВС/Очистка",null,null,"31-05-2017 00:00:00","31-05-2017 00:00:00"]
[419,"Республика Башкортостан","Уфимский муниципальный район","80652000","Кирилловский сельский совет","80652425","30860775","АО \"КОРПОРАЦИЯ РАЗВИТИЯ РЕСПУБЛИКИ БАШКОРТОСТАН\"","0274153834","027401001","Транспортировка воды","Питьевая","/ХВС/Транспортировка/Питьевая","10-01-2017 00:00:00",null,"10-01-2017 00:00:00"]
[420,"Республика Башкортостан","Уфимский муниципальный район","80652000","Кирилловский сельский совет","80652425","26812367","Куйбышевская дирекция  по тепловодоснабжению структурное подразделение Центральной дирекции по тепловодоснабжению филиала ПАО «РЖД»","7708503727","631145034","Транспортировка воды","Питьевая :: Питьевая :: Питьевая","/ХВС/Сбыт/Питьевая :: /ХВС/Транспортировка/Питьевая :: /ХВС/Производство/Питьевая",null,null,"31-12-2017 00:00:00","31-12-2017 00:00:00"]
[421,"Республика Башкортостан","Уфимский муниципальный район","80652000","Кирилловский сельский совет","80652425","26812367","Куйбышевская дирекция  по тепловодоснабжению структурное подразделение Центральной дирекции по тепловодоснабжению филиала ПАО «РЖД»","7708503727","631145034","Оказание услуг в сфере водоснабжения","Питьевая :: Питьевая :: Питьевая","/ХВС/Сбыт/Питьевая :: /ХВС/Транспортировка/Питьевая :: /ХВС/Производство/Питьевая",null,null,"31-12-2017 00:00:00","31-12-2017 00:00:00"]
[422,"Республика Башкортостан","Уфимский муниципальный район","80652000","Кирилловский сельский совет","80652425","30391868","ООО \"Универсал\"","0276138824","024501001","Оказание услуг в сфере водоснабжения","Питьевая :: Питьевая :: Питьевая","/ХВС/Сбыт/Питьевая :: /ХВС/Транспортировка/Питьевая :: /ХВС/Производство/Питьевая",null,"24-10-2017 00:00:00","25-01-2016 00:00:00","24-10-2017 00:00:00"]
[423,"Республика Башкортостан","Уфимский муниципальный район","80652000","Кирилловский сельский совет","80652425","30391868","ООО \"Универсал\"","0276138824","024501001","Транспортировка воды","Питьевая :: Питьевая :: Питьевая","/ХВС/Сбыт/Питьевая :: /ХВС/Транспортировка/Питьевая :: /ХВС/Производство/Питьевая",null,"24-10-2017 00:00:00","25-01-2016 00:00:00","24-10-2017 00:00:00"]
[424,"Республика Башкортостан","Уфимский муниципальный район","80652000","Кирилловский сельский совет","80652425","26454242","ООО ЖКХ \"Шемяк\"","0245021015","024501001","Оказание услуг в сфере водоснабжения","Подвоз воды :: Техническая :: Питьевая :: Техническая :: Питьевая :: Техническая :: Питьевая :: Очистка","/ХВС/Подвоз воды :: /ХВС/Сбыт/Техническая :: /ХВС/Сбыт/Питьевая :: /ХВС/Транспортировка/Техническая :: /ХВС/Транспортировка/Питьевая :: /ХВС/Производство/Техническая :: /ХВС/Производство/Питьевая :: /ХВС/Очистка",null,null,"10-12-2009 00:00:00"]
[425,"Республика Башкортостан","Уфимский муниципальный район","80652000","Кирилловский сельский совет","80652425","26353710","ООО\"Алексеевское коммунальное управление\" МР Уфимский район РБ","0245019753","024501001","Оказание услуг в сфере водоснабжения","Техническая :: Техническая :: Техническая :: Очистка","/ХВС/Сбыт/Техническая :: /ХВС/Транспортировка/Техническая :: /ХВС/Производство/Техническая :: /ХВС/Очистка",null,null,"31-05-2017 00:00:00"]
[426,"Республика Башкортостан","Уфимский муниципальный район","80652000","Кирилловский сельский совет","80652425","26353710","ООО\"Алексеевское коммунальное управление\" МР Уфимский район РБ","0245019753","024501001","Транспортировка воды","Техническая :: Техническая :: Техническая :: Очистка","/ХВС/Сбыт/Техническая :: /ХВС/Транспортировка/Техническая :: /ХВС/Производство/Техническая :: /ХВС/Очистка",null,null,"31-05-2017 00:00:00"]
[427,"Республика Башкортостан","Уфимский муниципальный район","80652000","Красноярский сельский совет","80652430","27566970","ООО \"ЖКХ \"Красный Яр\"","0245022202","024501001","Оказание услуг в сфере водоснабжения","Подвоз воды :: Техническая :: Питьевая :: Техническая :: Питьевая :: Техническая :: Питьевая :: Очистка","/ХВС/Подвоз воды :: /ХВС/Сбыт/Техническая :: /ХВС/Сбыт/Питьевая :: /ХВС/Транспортировка/Техническая :: /ХВС/Транспортировка/Питьевая :: /ХВС/Производство/Техническая :: /ХВС/Производство/Питьевая :: /ХВС/Очистка",null,null,"10-01-2012 00:00:00"]
[428,"Республика Башкортостан","Уфимский муниципальный район","80652000","Красноярский сельский совет","80652430","26454242","ООО ЖКХ \"Шемяк\"","0245021015","024501001","Оказание услуг в сфере водоснабжения","Подвоз воды :: Техническая :: Питьевая :: Техническая :: Питьевая :: Техническая :: Питьевая :: Очистка","/ХВС/Подвоз воды :: /ХВС/Сбыт/Техническая :: /ХВС/Сбыт/Питьевая :: /ХВС/Транспортировка/Техническая :: /ХВС/Транспортировка/Питьевая :: /ХВС/Производство/Техническая :: /ХВС/Производство/Питьевая :: /ХВС/Очистка",null,null,"10-12-2009 00:00:00"]
[429,"Республика Башкортостан","Уфимский муниципальный район","80652000","Миловский сельский совет","80652435","28974612","ООО \"СК \"МИЛОВСКИЙ ПАРК\"","0276150349","027601001","Транспортировка воды","Техническая :: Техническая :: Техническая","/ХВС/Сбыт/Техническая :: /ХВС/Транспортировка/Техническая :: /ХВС/Производство/Техническая","25-05-2015 00:00:00",null,"03-08-2016 00:00:00","28-06-2017 00:00:00"]
[430,"Республика Башкортостан","Уфимский муниципальный район","80652000","Миловский сельский совет","80652435","28974612","ООО \"СК \"МИЛОВСКИЙ ПАРК\"","0276150349","027601001","Оказание услуг в сфере водоснабжения","Техническая :: Техническая :: Техническая","/ХВС/Сбыт/Техническая :: /ХВС/Транспортировка/Техническая :: /ХВС/Производство/Техническая","25-05-2015 00:00:00",null,"03-08-2016 00:00:00","28-06-2017 00:00:00"]
[431,"Республика Башкортостан","Уфимский муниципальный район","80652000","Миловский сельский совет","80652435","28974612","ООО \"СК \"МИЛОВСКИЙ ПАРК\"","0276150349","027601001","Оказание услуг в сфере водоснабжения","Подвоз воды :: Питьевая :: Питьевая :: Питьевая :: Очистка","/ХВС/Подвоз воды :: /ХВС/Сбыт/Питьевая :: /ХВС/Транспортировка/Питьевая :: /ХВС/Производство/Питьевая :: /ХВС/Очистка","25-05-2015 00:00:00",null,"03-08-2016 00:00:00"]
[432,"Республика Башкортостан","Уфимский муниципальный район","80652000","Миловский сельский совет","80652435","26454242","ООО ЖКХ \"Шемяк\"","0245021015","024501001","Оказание услуг в сфере водоснабжения","Подвоз воды :: Техническая :: Питьевая :: Техническая :: Питьевая :: Техническая :: Питьевая :: Очистка","/ХВС/Подвоз воды :: /ХВС/Сбыт/Техническая :: /ХВС/Сбыт/Питьевая :: /ХВС/Транспортировка/Техническая :: /ХВС/Транспортировка/Питьевая :: /ХВС/Производство/Техническая :: /ХВС/Производство/Питьевая :: /ХВС/Очистка",null,null,"10-12-2009 00:00:00"]
[433,"Республика Башкортостан","Уфимский муниципальный район","80652000","Миловский сельский совет","80652435","31082673","ООО КК \"Миловский парк\"","0278933218","027801001","Оказание услуг в сфере водоснабжения","Техническая :: Техническая :: Техническая :: Очистка","/ХВС/Сбыт/Техническая :: /ХВС/Транспортировка/Техническая :: /ХВС/Производство/Техническая :: /ХВС/Очистка","03-05-2018 00:00:00",null,"03-05-2018 00:00:00","03-05-2018 00:00:00"]
[434,"Республика Башкортостан","Уфимский муниципальный район","80652000","Миловский сельский совет","80652435","31082673","ООО КК \"Миловский парк\"","0278933218","027801001","Транспортировка воды","Техническая :: Техническая :: Техническая :: Очистка","/ХВС/Сбыт/Техническая :: /ХВС/Транспортировка/Техническая :: /ХВС/Производство/Техническая :: /ХВС/Очистка","03-05-2018 00:00:00",null,"03-05-2018 00:00:00","03-05-2018 00:00:00"]
[435,"Республика Башкортостан","Уфимский муниципальный район","80652000","Михайловский сельский совет","80652440","26454242","ООО ЖКХ \"Шемяк\"","0245021015","024501001","Оказание услуг в сфере водоснабжения","Подвоз воды :: Техническая :: Питьевая :: Техническая :: Питьевая :: Техническая :: Питьевая :: Очистка","/ХВС/Подвоз воды :: /ХВС/Сбыт/Техническая :: /ХВС/Сбыт/Питьевая :: /ХВС/Транспортировка/Техническая :: /ХВС/Транспортировка/Питьевая :: /ХВС/Производство/Техническая :: /ХВС/Производство/Питьевая :: /ХВС/Очистка",null,null,"10-12-2009 00:00:00"]
[436,"Республика Башкортостан","Уфимский муниципальный район","80652000","Николаевский сельский совет","80652450","26454236","ООО \"Стройресурсы\"","0245019785","024501001","Оказание услуг в сфере водоснабжения","Подвоз воды :: Техническая :: Техническая :: Техническая :: Очистка","/ХВС/Подвоз воды :: /ХВС/Сбыт/Техническая :: /ХВС/Транспортировка/Техническая :: /ХВС/Производство/Техническая :: /ХВС/Очистка",null,null,"31-05-2017 00:00:00"]
[437,"Республика Башкортостан","Уфимский муниципальный район","80652000","Николаевский сельский совет","80652450","26760333","ООО КХ «Николаевское»","0245021400","024501001","Оказание услуг в сфере водоснабжения","Подвоз воды :: Техническая :: Питьевая :: Техническая :: Питьевая :: Техническая :: Питьевая :: Очистка","/ХВС/Подвоз воды :: /ХВС/Сбыт/Техническая :: /ХВС/Сбыт/Питьевая :: /ХВС/Транспортировка/Техническая :: /ХВС/Транспортировка/Питьевая :: /ХВС/Производство/Техническая :: /ХВС/Производство/Питьевая :: /ХВС/Очистка",null,"29-05-2017 00:00:00","01-02-2011 00:00:00","29-05-2017 00:00:00"]
[438,"Республика Башкортостан","Уфимский муниципальный район","80652000","Николаевский сельский совет","80652450","27556109","Черкасское НУ филиал АО \"Транснефть-Урал\"","0278039018","024502001","Оказание услуг в сфере водоснабжения","Подвоз воды :: Техническая :: Питьевая :: Техническая :: Питьевая :: Техническая :: Питьевая :: Очистка","/ХВС/Подвоз воды :: /ХВС/Сбыт/Техническая :: /ХВС/Сбыт/Питьевая :: /ХВС/Транспортировка/Техническая :: /ХВС/Транспортировка/Питьевая :: /ХВС/Производство/Техническая :: /ХВС/Производство/Питьевая :: /ХВС/Очистка",null,null,"30-12-2011 00:00:00"]
[439,"Республика Башкортостан","Уфимский муниципальный район","80652000","Ольховский сельский совет","80652452","26454242","ООО ЖКХ \"Шемяк\"","0245021015","024501001","Оказание услуг в сфере водоснабжения","Подвоз воды :: Техническая :: Питьевая :: Техническая :: Питьевая :: Техническая :: Питьевая :: Очистка","/ХВС/Подвоз воды :: /ХВС/Сбыт/Техническая :: /ХВС/Сбыт/Питьевая :: /ХВС/Транспортировка/Техническая :: /ХВС/Транспортировка/Питьевая :: /ХВС/Производство/Техническая :: /ХВС/Производство/Питьевая :: /ХВС/Очистка",null,null,"10-12-2009 00:00:00"]
[440,"Республика Башкортостан","Уфимский муниципальный район","80652000","Русско-Юрмашский сельский совет","80652455","26353710","ООО\"Алексеевское коммунальное управление\" МР Уфимский район РБ","0245019753","024501001","Оказание услуг в сфере водоснабжения","Подвоз воды :: Техническая :: Питьевая :: Техническая :: Питьевая :: Техническая :: Питьевая :: Очистка","/ХВС/Подвоз воды :: /ХВС/Сбыт/Техническая :: /ХВС/Сбыт/Питьевая :: /ХВС/Транспортировка/Техническая :: /ХВС/Транспортировка/Питьевая :: /ХВС/Производство/Техническая :: /ХВС/Производство/Питьевая :: /ХВС/Очистка",null,null,"15-09-2008 00:00:00"]
[441,"Республика Башкортостан","Уфимский муниципальный район","80652000","Черкасский сельский совет","80652472","26454242","ООО ЖКХ \"Шемяк\"","0245021015","024501001","Оказание услуг в сфере водоснабжения","Подвоз воды :: Техническая :: Питьевая :: Техническая :: Питьевая :: Техническая :: Питьевая :: Очистка","/ХВС/Подвоз воды :: /ХВС/Сбыт/Техническая :: /ХВС/Сбыт/Питьевая :: /ХВС/Транспортировка/Техническая :: /ХВС/Транспортировка/Питьевая :: /ХВС/Производство/Техническая :: /ХВС/Производство/Питьевая :: /ХВС/Очистка",null,null,"12-07-2016 00:00:00"]
[442,"Республика Башкортостан","Уфимский муниципальный район","80652000","Чесноковский сельский совет","80652473","26812367","Куйбышевская дирекция  по тепловодоснабжению структурное подразделение Центральной дирекции по тепловодоснабжению филиала ПАО «РЖД»","7708503727","631145034","Оказание услуг в сфере водоснабжения","Питьевая :: Питьевая :: Питьевая","/ХВС/Сбыт/Питьевая :: /ХВС/Транспортировка/Питьевая :: /ХВС/Производство/Питьевая",null,null,"31-12-2017 00:00:00","31-12-2017 00:00:00"]
[443,"Республика Башкортостан","Уфимский муниципальный район","80652000","Чесноковский сельский совет","80652473","26812367","Куйбышевская дирекция  по тепловодоснабжению структурное подразделение Центральной дирекции по тепловодоснабжению филиала ПАО «РЖД»","7708503727","631145034","Транспортировка воды","Питьевая :: Питьевая :: Питьевая","/ХВС/Сбыт/Питьевая :: /ХВС/Транспортировка/Питьевая :: /ХВС/Производство/Питьевая",null,null,"31-12-2017 00:00:00","31-12-2017 00:00:00"]
[444,"Республика Башкортостан","Уфимский муниципальный район","80652000","Чесноковский сельский совет","80652473","26454242","ООО ЖКХ \"Шемяк\"","0245021015","024501001","Оказание услуг в сфере водоснабжения","Подвоз воды :: Техническая :: Питьевая :: Техническая :: Питьевая :: Техническая :: Питьевая :: Очистка","/ХВС/Подвоз воды :: /ХВС/Сбыт/Техническая :: /ХВС/Сбыт/Питьевая :: /ХВС/Транспортировка/Техническая :: /ХВС/Транспортировка/Питьевая :: /ХВС/Производство/Техническая :: /ХВС/Производство/Питьевая :: /ХВС/Очистка",null,null,"10-12-2009 00:00:00"]
[445,"Республика Башкортостан","Уфимский муниципальный район","80652000","Шемякский сельский совет","80652475","28983504","ООО \"РЕСУРССНАБ\"","0245027659","024501001","Оказание услуг в сфере водоснабжения","Подвоз воды :: Техническая :: Питьевая :: Техническая :: Питьевая :: Техническая :: Питьевая :: Очистка","/ХВС/Подвоз воды :: /ХВС/Сбыт/Техническая :: /ХВС/Сбыт/Питьевая :: /ХВС/Транспортировка/Техническая :: /ХВС/Транспортировка/Питьевая :: /ХВС/Производство/Техническая :: /ХВС/Производство/Питьевая :: /ХВС/Очистка","30-07-2015 00:00:00",null,"30-07-2015 00:00:00"]
[446,"Республика Башкортостан","Уфимский муниципальный район","80652000","Шемякский сельский совет","80652475","26454242","ООО ЖКХ \"Шемяк\"","0245021015","024501001","Оказание услуг в сфере водоснабжения","Подвоз воды :: Техническая :: Питьевая :: Техническая :: Питьевая :: Техническая :: Питьевая :: Очистка","/ХВС/Подвоз воды :: /ХВС/Сбыт/Техническая :: /ХВС/Сбыт/Питьевая :: /ХВС/Транспортировка/Техническая :: /ХВС/Транспортировка/Питьевая :: /ХВС/Производство/Техническая :: /ХВС/Производство/Питьевая :: /ХВС/Очистка",null,null,"10-12-2009 00:00:00"]
[447,"Республика Башкортостан","Уфимский муниципальный район","80652000","Юматовский сельский совет","80652480","26353653","ГУП санаторий \"Юматово\"","0245011962","024501001","Оказание услуг в сфере водоснабжения","Подвоз воды :: Техническая :: Питьевая :: Техническая :: Питьевая :: Техническая :: Питьевая :: Очистка","/ХВС/Подвоз воды :: /ХВС/Сбыт/Техническая :: /ХВС/Сбыт/Питьевая :: /ХВС/Транспортировка/Техническая :: /ХВС/Транспортировка/Питьевая :: /ХВС/Производство/Техническая :: /ХВС/Производство/Питьевая :: /ХВС/Очистка",null,"31-12-2017 00:00:00","15-09-2008 00:00:00","31-12-2017 00:00:00"]
[448,"Республика Башкортостан","Уфимский муниципальный район","80652000","Юматовский сельский совет","80652480","31082673","ООО КК \"Миловский парк\"","0278933218","027801001","Оказание услуг в сфере водоснабжения","Техническая :: Техническая :: Техническая :: Очистка","/ХВС/Сбыт/Техническая :: /ХВС/Транспортировка/Техническая :: /ХВС/Производство/Техническая :: /ХВС/Очистка","03-05-2018 00:00:00",null,"01-04-2018 00:00:00"]
[449,"Республика Башкортостан","Уфимский муниципальный район","80652000","Юматовский сельский совет","80652480","31082673","ООО КК \"Миловский парк\"","0278933218","027801001","Транспортировка воды","Техническая :: Техническая :: Техническая :: Очистка","/ХВС/Сбыт/Техническая :: /ХВС/Транспортировка/Техническая :: /ХВС/Производство/Техническая :: /ХВС/Очистка","03-05-2018 00:00:00",null,"01-04-2018 00:00:00"]
[450,"Республика Башкортостан","Учалинский муниципальный район","80653000","Амангильдинский сельский совет","80653410","30354111","ООО \"АКВАСТРОЙСЕРВИС\"","0270022220","027001001","Транспортировка воды","Питьевая :: Питьевая :: Питьевая","/ХВС/Сбыт/Питьевая :: /ХВС/Транспортировка/Питьевая :: /ХВС/Производство/Питьевая","26-10-2015 00:00:00",null,"15-01-2016 00:00:00"]
[451,"Республика Башкортостан","Учалинский муниципальный район","80653000","Амангильдинский сельский совет","80653410","30354111","ООО \"АКВАСТРОЙСЕРВИС\"","0270022220","027001001","Оказание услуг в сфере водоснабжения","Питьевая :: Питьевая :: Питьевая","/ХВС/Сбыт/Питьевая :: /ХВС/Транспортировка/Питьевая :: /ХВС/Производство/Питьевая","26-10-2015 00:00:00",null,"15-01-2016 00:00:00"]
[452,"Республика Башкортостан","Учалинский муниципальный район","80653000","Город Учалы","80653101","26353691","АО \"Учалинский горно-обогатительный комбинат\"","0270007455","997550001","Оказание услуг в сфере водоснабжения","Подвоз воды :: Техническая :: Питьевая :: Техническая :: Питьевая :: Техническая :: Питьевая :: Очистка","/ХВС/Подвоз воды :: /ХВС/Сбыт/Техническая :: /ХВС/Сбыт/Питьевая :: /ХВС/Транспортировка/Техническая :: /ХВС/Транспортировка/Питьевая :: /ХВС/Производство/Техническая :: /ХВС/Производство/Питьевая :: /ХВС/Очистка","09-04-2012 00:00:00",null,"09-04-2012 00:00:00"]
[453,"Республика Башкортостан","Учалинский муниципальный район","80653000","Город Учалы","80653101","26472460","МУП \"Учалыводоканал\"","0270000570","027001001","Оказание услуг в сфере водоснабжения","Подвоз воды :: Техническая :: Питьевая :: Техническая :: Питьевая :: Техническая :: Питьевая :: Очистка","/ХВС/Подвоз воды :: /ХВС/Сбыт/Техническая :: /ХВС/Сбыт/Питьевая :: /ХВС/Транспортировка/Техническая :: /ХВС/Транспортировка/Питьевая :: /ХВС/Производство/Техническая :: /ХВС/Производство/Питьевая :: /ХВС/Очистка",null,null,"15-01-2010 00:00:00"]
[454,"Республика Башкортостан","Учалинский муниципальный район","80653000","Город Учалы","80653101","26353690","ОАО \"Учалинский горно-обогатительный комбинат\"","0270007455","025250001","Транспортировка воды","Техническая :: Питьевая","/ХВС/Транспортировка/Техническая :: /ХВС/Транспортировка/Питьевая","06-08-2002 00:00:00",null,"06-08-2002 00:00:00","31-12-2017 00:00:00"]
[455,"Республика Башкортостан","Учалинский муниципальный район","80653000","Имангуловский сельский совет","80653430","30354111","ООО \"АКВАСТРОЙСЕРВИС\"","0270022220","027001001","Оказание услуг в сфере водоснабжения","Питьевая :: Питьевая :: Питьевая","/ХВС/Сбыт/Питьевая :: /ХВС/Транспортировка/Питьевая :: /ХВС/Производство/Питьевая","26-10-2015 00:00:00",null,"26-01-2017 00:00:00"]
[456,"Республика Башкортостан","Учалинский муниципальный район","80653000","Имангуловский сельский совет","80653430","30354111","ООО \"АКВАСТРОЙСЕРВИС\"","0270022220","027001001","Транспортировка воды","Питьевая :: Питьевая :: Питьевая","/ХВС/Сбыт/Питьевая :: /ХВС/Транспортировка/Питьевая :: /ХВС/Производство/Питьевая","26-10-2015 00:00:00",null,"26-01-2017 00:00:00"]
[457,"Республика Башкортостан","Учалинский муниципальный район","80653000","Кунакбаевский сельский совет","80653445","30354111","ООО \"АКВАСТРОЙСЕРВИС\"","0270022220","027001001","Оказание услуг в сфере водоснабжения","Питьевая :: Питьевая :: Питьевая","/ХВС/Сбыт/Питьевая :: /ХВС/Транспортировка/Питьевая :: /ХВС/Производство/Питьевая","26-10-2015 00:00:00",null,"19-06-2017 00:00:00"]
[458,"Республика Башкортостан","Учалинский муниципальный район","80653000","Кунакбаевский сельский совет","80653445","30354111","ООО \"АКВАСТРОЙСЕРВИС\"","0270022220","027001001","Транспортировка воды","Питьевая :: Питьевая :: Питьевая","/ХВС/Сбыт/Питьевая :: /ХВС/Транспортировка/Питьевая :: /ХВС/Производство/Питьевая","26-10-2015 00:00:00",null,"19-06-2017 00:00:00"]
[459,"Республика Башкортостан","Учалинский муниципальный район","80653000","Мансуровский сельский совет","80653449","30393750","ИП Яшельбаев Ильфат Фатихович","027004162625","отсутствует","Транспортировка воды","Питьевая :: Питьевая :: Питьевая :: Очистка","/ХВС/Сбыт/Питьевая :: /ХВС/Транспортировка/Питьевая :: /ХВС/Производство/Питьевая :: /ХВС/Очистка","28-01-2016 00:00:00",null,"28-01-2016 00:00:00"]
[460,"Республика Башкортостан","Учалинский муниципальный район","80653000","Мансуровский сельский совет","80653449","30393750","ИП Яшельбаев Ильфат Фатихович","027004162625","отсутствует","Оказание услуг в сфере водоснабжения","Питьевая :: Питьевая :: Питьевая :: Очистка","/ХВС/Сбыт/Питьевая :: /ХВС/Транспортировка/Питьевая :: /ХВС/Производство/Питьевая :: /ХВС/Очистка","28-01-2016 00:00:00",null,"28-01-2016 00:00:00"]
[461,"Республика Башкортостан","Учалинский муниципальный район","80653000","Мансуровский сельский совет","80653449","26450974","МУП \"Коммунальщик\" (Учалинский МР)","0270016629","027001001","Оказание услуг в сфере водоснабжения","Подвоз воды :: Техническая :: Питьевая :: Техническая :: Питьевая :: Техническая :: Питьевая :: Очистка","/ХВС/Подвоз воды :: /ХВС/Сбыт/Техническая :: /ХВС/Сбыт/Питьевая :: /ХВС/Транспортировка/Техническая :: /ХВС/Транспортировка/Питьевая :: /ХВС/Производство/Техническая :: /ХВС/Производство/Питьевая :: /ХВС/Очистка",null,null,"08-12-2009 00:00:00"]
[462,"Республика Башкортостан","Учалинский муниципальный район","80653000","Тунгатаровский сельский совет","80653484","26360992","Южно-Уральская дирекция по тепловодоснабжению - структурное подразделение Центральной дирекции по тепловодоснабжению - филиала ОАО \"РЖД\"","7708503727","744945004","Оказание услуг в сфере водоснабжения","Подвоз воды :: Питьевая :: Питьевая :: Питьевая :: Очистка","/ХВС/Подвоз воды :: /ХВС/Сбыт/Питьевая :: /ХВС/Транспортировка/Питьевая :: /ХВС/Производство/Питьевая :: /ХВС/Очистка","23-09-2003 00:00:00",null,"18-10-2016 00:00:00"]
[463,"Республика Башкортостан","Учалинский муниципальный район","80653000","Уразовский сельский совет","80653488","26450974","МУП \"Коммунальщик\" (Учалинский МР)","0270016629","027001001","Оказание услуг в сфере водоснабжения","Подвоз воды :: Техническая :: Питьевая :: Техническая :: Питьевая :: Техническая :: Питьевая :: Очистка","/ХВС/Подвоз воды :: /ХВС/Сбыт/Техническая :: /ХВС/Сбыт/Питьевая :: /ХВС/Транспортировка/Техническая :: /ХВС/Транспортировка/Питьевая :: /ХВС/Производство/Техническая :: /ХВС/Производство/Питьевая :: /ХВС/Очистка",null,null,"08-12-2009 00:00:00"]
[464,"Республика Башкортостан","Учалинский муниципальный район","80653000","Уральский сельский совет","80653491","28829093","ИП Хакимова Гузель Набибовна","027001444283","отсутствует","Оказание услуг в сфере водоснабжения","Подвоз воды :: Техническая :: Питьевая :: Техническая :: Питьевая :: Техническая :: Питьевая :: Очистка","/ХВС/Подвоз воды :: /ХВС/Сбыт/Техническая :: /ХВС/Сбыт/Питьевая :: /ХВС/Транспортировка/Техническая :: /ХВС/Транспортировка/Питьевая :: /ХВС/Производство/Техническая :: /ХВС/Производство/Питьевая :: /ХВС/Очистка","24-11-2014 00:00:00","23-10-2017 00:00:00","24-11-2014 00:00:00","23-10-2017 00:00:00"]
[465,"Республика Башкортостан","Учалинский муниципальный район","80653000","Уральский сельский совет","80653491","26450974","МУП \"Коммунальщик\" (Учалинский МР)","0270016629","027001001","Оказание услуг в сфере водоснабжения","Подвоз воды :: Техническая :: Питьевая :: Техническая :: Питьевая :: Техническая :: Питьевая :: Очистка","/ХВС/Подвоз воды :: /ХВС/Сбыт/Техническая :: /ХВС/Сбыт/Питьевая :: /ХВС/Транспортировка/Техническая :: /ХВС/Транспортировка/Питьевая :: /ХВС/Производство/Техническая :: /ХВС/Производство/Питьевая :: /ХВС/Очистка",null,null,"08-12-2009 00:00:00"]
[466,"Республика Башкортостан","Учалинский муниципальный район","80653000","Учалинский сельский совет","80653496","31007051","Индивидульный предприниматель Киньябаев Ильдус Идельбаевич","027007335114","отсутствует","Оказание услуг в сфере водоснабжения","Подвоз воды :: Техническая :: Питьевая :: Техническая :: Питьевая :: Техническая :: Питьевая :: Очистка","/ХВС/Подвоз воды :: /ХВС/Сбыт/Техническая :: /ХВС/Сбыт/Питьевая :: /ХВС/Транспортировка/Техническая :: /ХВС/Транспортировка/Питьевая :: /ХВС/Производство/Техническая :: /ХВС/Производство/Питьевая :: /ХВС/Очистка","22-12-2017 00:00:00",null,"22-12-2017 00:00:00"]
[467,"Республика Башкортостан","Учалинский муниципальный район","80653000","Учалинский сельский совет","80653496","26450974","МУП \"Коммунальщик\" (Учалинский МР)","0270016629","027001001","Оказание услуг в сфере водоснабжения","Подвоз воды :: Техническая :: Питьевая :: Техническая :: Питьевая :: Техническая :: Питьевая :: Очистка","/ХВС/Подвоз воды :: /ХВС/Сбыт/Техническая :: /ХВС/Сбыт/Питьевая :: /ХВС/Транспортировка/Техническая :: /ХВС/Транспортировка/Питьевая :: /ХВС/Производство/Техническая :: /ХВС/Производство/Питьевая :: /ХВС/Очистка",null,null,"08-12-2009 00:00:00"]
[468,"Республика Башкортостан","Федоровский муниципальный район","80654000","Бала-Четырманский сельский совет","80654405","26472462","ООО \"Водоканал\" Федоровский район","0247004343","024701001","Оказание услуг в сфере водоснабжения","Техническая :: Питьевая :: Техническая :: Питьевая :: Техническая :: Питьевая","/ХВС/Сбыт/Техническая :: /ХВС/Сбыт/Питьевая :: /ХВС/Транспортировка/Техническая :: /ХВС/Транспортировка/Питьевая :: /ХВС/Производство/Техническая :: /ХВС/Производство/Питьевая",null,null,"28-07-2016 00:00:00"]
[469,"Республика Башкортостан","Федоровский муниципальный район","80654000","Бала-Четырманский сельский совет","80654405","26472462","ООО \"Водоканал\" Федоровский район","0247004343","024701001","Транспортировка воды","Техническая :: Питьевая :: Техническая :: Питьевая :: Техническая :: Питьевая","/ХВС/Сбыт/Техническая :: /ХВС/Сбыт/Питьевая :: /ХВС/Транспортировка/Техническая :: /ХВС/Транспортировка/Питьевая :: /ХВС/Производство/Техническая :: /ХВС/Производство/Питьевая",null,null,"28-07-2016 00:00:00"]
[470,"Республика Башкортостан","Федоровский муниципальный район","80654000","Гончаровский сельский совет","80654417","26472462","ООО \"Водоканал\" Федоровский район","0247004343","024701001","Транспортировка воды","Техническая :: Питьевая :: Техническая :: Питьевая :: Техническая :: Питьевая","/ХВС/Сбыт/Техническая :: /ХВС/Сбыт/Питьевая :: /ХВС/Транспортировка/Техническая :: /ХВС/Транспортировка/Питьевая :: /ХВС/Производство/Техническая :: /ХВС/Производство/Питьевая",null,null,"28-07-2016 00:00:00"]
[471,"Республика Башкортостан","Федоровский муниципальный район","80654000","Гончаровский сельский совет","80654417","26472462","ООО \"Водоканал\" Федоровский район","0247004343","024701001","Оказание услуг в сфере водоснабжения","Техническая :: Питьевая :: Техническая :: Питьевая :: Техническая :: Питьевая","/ХВС/Сбыт/Техническая :: /ХВС/Сбыт/Питьевая :: /ХВС/Транспортировка/Техническая :: /ХВС/Транспортировка/Питьевая :: /ХВС/Производство/Техническая :: /ХВС/Производство/Питьевая",null,null,"28-07-2016 00:00:00"]
[472,"Республика Башкортостан","Федоровский муниципальный район","80654000","Федоровский сельский совет","80654460","26472462","ООО \"Водоканал\" Федоровский район","0247004343","024701001","Оказание услуг в сфере водоснабжения","Техническая :: Питьевая :: Техническая :: Питьевая :: Техническая :: Питьевая","/ХВС/Сбыт/Техническая :: /ХВС/Сбыт/Питьевая :: /ХВС/Транспортировка/Техническая :: /ХВС/Транспортировка/Питьевая :: /ХВС/Производство/Техническая :: /ХВС/Производство/Питьевая",null,null,"15-01-2010 00:00:00"]
[473,"Республика Башкортостан","Федоровский муниципальный район","80654000","Федоровский сельский совет","80654460","26472462","ООО \"Водоканал\" Федоровский район","0247004343","024701001","Транспортировка воды","Техническая :: Питьевая :: Техническая :: Питьевая :: Техническая :: Питьевая","/ХВС/Сбыт/Техническая :: /ХВС/Сбыт/Питьевая :: /ХВС/Транспортировка/Техническая :: /ХВС/Транспортировка/Питьевая :: /ХВС/Производство/Техническая :: /ХВС/Производство/Питьевая",null,null,"15-01-2010 00:00:00"]
[474,"Республика Башкортостан","Хайбуллинский муниципальный район","80655000","Акъярский сельский совет","80655415","28464317","МУП \"ХАЙБУЛЛАЖИЛКОМСТРОЙ\"","0248008051","024801001","Оказание услуг в сфере водоснабжения","Подвоз воды :: Техническая :: Питьевая :: Техническая :: Питьевая :: Техническая :: Питьевая :: Очистка","/ХВС/Подвоз воды :: /ХВС/Сбыт/Техническая :: /ХВС/Сбыт/Питьевая :: /ХВС/Транспортировка/Техническая :: /ХВС/Транспортировка/Питьевая :: /ХВС/Производство/Техническая :: /ХВС/Производство/Питьевая :: /ХВС/Очистка","29-01-2014 00:00:00",null,"08-07-2016 00:00:00"]
[475,"Республика Башкортостан","Хайбуллинский муниципальный район","80655000","Бурибайский сельский совет","80655424","28464376","ООО \"Коммунальщик\" (Хайбуллинский МР)","0248005540","024801001","Оказание услуг в сфере водоснабжения","Подвоз воды :: Техническая :: Питьевая :: Техническая :: Питьевая :: Техническая :: Питьевая :: Очистка","/ХВС/Подвоз воды :: /ХВС/Сбыт/Техническая :: /ХВС/Сбыт/Питьевая :: /ХВС/Транспортировка/Техническая :: /ХВС/Транспортировка/Питьевая :: /ХВС/Производство/Техническая :: /ХВС/Производство/Питьевая :: /ХВС/Очистка","29-01-2014 00:00:00",null,"29-01-2014 00:00:00"]
[476,"Республика Башкортостан","Хайбуллинский муниципальный район","80655000","Таналыкский сельский совет","80655440","26472476","ООО \"УК Уфимское ЖКХ\"","0248006311","024801001","Оказание услуг в сфере водоснабжения","Подвоз воды :: Техническая :: Питьевая :: Техническая :: Питьевая :: Техническая :: Питьевая :: Очистка","/ХВС/Подвоз воды :: /ХВС/Сбыт/Техническая :: /ХВС/Сбыт/Питьевая :: /ХВС/Транспортировка/Техническая :: /ХВС/Транспортировка/Питьевая :: /ХВС/Производство/Техническая :: /ХВС/Производство/Питьевая :: /ХВС/Очистка",null,null,"15-01-2010 00:00:00","31-12-2017 00:00:00"]
[477,"Республика Башкортостан","Хайбуллинский муниципальный район","80655000","Таналыкский сельский совет","80655440","26797482","ООО «Родник»","0248006985","024801001","Оказание услуг в сфере водоснабжения","Подвоз воды :: Техническая :: Питьевая :: Техническая :: Питьевая :: Техническая :: Питьевая :: Очистка","/ХВС/Подвоз воды :: /ХВС/Сбыт/Техническая :: /ХВС/Сбыт/Питьевая :: /ХВС/Транспортировка/Техническая :: /ХВС/Транспортировка/Питьевая :: /ХВС/Производство/Техническая :: /ХВС/Производство/Питьевая :: /ХВС/Очистка","29-01-2014 00:00:00",null,"29-01-2014 00:00:00"]
[478,"Республика Башкортостан","Хайбуллинский муниципальный район","80655000","Уфимский сельский совет","80655445","28501481","ООО УК \"КомУслугиУфимский\"","0248008005","024801001","Оказание услуг в сфере водоснабжения","Подвоз воды :: Техническая :: Питьевая :: Техническая :: Питьевая :: Техническая :: Питьевая :: Очистка","/ХВС/Подвоз воды :: /ХВС/Сбыт/Техническая :: /ХВС/Сбыт/Питьевая :: /ХВС/Транспортировка/Техническая :: /ХВС/Транспортировка/Питьевая :: /ХВС/Производство/Техническая :: /ХВС/Производство/Питьевая :: /ХВС/Очистка","18-04-2014 00:00:00",null,"18-04-2014 00:00:00"]
[479,"Республика Башкортостан","Чекмагушевский муниципальный район","80656000","Новобалтачевский сельский совет","80656425","28487276","Чекмагушевское МУП по водоснабжению","0249005215","024901001","Оказание услуг в сфере водоснабжения","Питьевая :: Техническая :: Питьевая :: Питьевая","/ХВС/Сбыт/Питьевая :: /ХВС/Транспортировка/Техническая :: /ХВС/Транспортировка/Питьевая :: /ХВС/Производство/Питьевая","25-02-2014 00:00:00",null,"21-07-2016 00:00:00"]
[480,"Республика Башкортостан","Чекмагушевский муниципальный район","80656000","Новобалтачевский сельский совет","80656425","28487276","Чекмагушевское МУП по водоснабжению","0249005215","024901001","Транспортировка воды","Питьевая :: Техническая :: Питьевая :: Питьевая","/ХВС/Сбыт/Питьевая :: /ХВС/Транспортировка/Техническая :: /ХВС/Транспортировка/Питьевая :: /ХВС/Производство/Питьевая","25-02-2014 00:00:00",null,"21-07-2016 00:00:00"]
[481,"Республика Башкортостан","Чекмагушевский муниципальный район","80656000","Старокалмашевский сельский совет","80656450","28487276","Чекмагушевское МУП по водоснабжению","0249005215","024901001","Оказание услуг в сфере водоснабжения","Питьевая :: Техническая :: Питьевая :: Питьевая","/ХВС/Сбыт/Питьевая :: /ХВС/Транспортировка/Техническая :: /ХВС/Транспортировка/Питьевая :: /ХВС/Производство/Питьевая","25-02-2014 00:00:00",null,"21-07-2016 00:00:00"]
[482,"Республика Башкортостан","Чекмагушевский муниципальный район","80656000","Старокалмашевский сельский совет","80656450","28487276","Чекмагушевское МУП по водоснабжению","0249005215","024901001","Транспортировка воды","Питьевая :: Техническая :: Питьевая :: Питьевая","/ХВС/Сбыт/Питьевая :: /ХВС/Транспортировка/Техническая :: /ХВС/Транспортировка/Питьевая :: /ХВС/Производство/Питьевая","25-02-2014 00:00:00",null,"21-07-2016 00:00:00"]
[483,"Республика Башкортостан","Чекмагушевский муниципальный район","80656000","Урнякский сельский совет","80656465","28487276","Чекмагушевское МУП по водоснабжению","0249005215","024901001","Транспортировка воды","Питьевая :: Техническая :: Питьевая :: Питьевая","/ХВС/Сбыт/Питьевая :: /ХВС/Транспортировка/Техническая :: /ХВС/Транспортировка/Питьевая :: /ХВС/Производство/Питьевая","25-02-2014 00:00:00",null,"21-07-2016 00:00:00"]
[484,"Республика Башкортостан","Чекмагушевский муниципальный район","80656000","Урнякский сельский совет","80656465","28487276","Чекмагушевское МУП по водоснабжению","0249005215","024901001","Оказание услуг в сфере водоснабжения","Питьевая :: Техническая :: Питьевая :: Питьевая","/ХВС/Сбыт/Питьевая :: /ХВС/Транспортировка/Техническая :: /ХВС/Транспортировка/Питьевая :: /ХВС/Производство/Питьевая","25-02-2014 00:00:00",null,"21-07-2016 00:00:00"]
[485,"Республика Башкортостан","Чекмагушевский муниципальный район","80656000","Чекмагушевский сельский совет","80656470","26759540","МУЗ Чекмагушевская ЦРБ","0249002239","024901001","Оказание услуг в сфере водоснабжения","Подвоз воды :: Техническая :: Питьевая :: Техническая :: Питьевая :: Техническая :: Питьевая :: Очистка","/ХВС/Подвоз воды :: /ХВС/Сбыт/Техническая :: /ХВС/Сбыт/Питьевая :: /ХВС/Транспортировка/Техническая :: /ХВС/Транспортировка/Питьевая :: /ХВС/Производство/Техническая :: /ХВС/Производство/Питьевая :: /ХВС/Очистка",null,null,"01-02-2011 00:00:00"]
[486,"Республика Башкортостан","Чекмагушевский муниципальный район","80656000","Чекмагушевский сельский совет","80656470","26353659","ООО \"Чекмагушевское ПУЖКХ\"","0249006970","024901001","Оказание услуг в сфере водоснабжения","Подвоз воды :: Техническая :: Питьевая :: Техническая :: Питьевая :: Техническая :: Питьевая :: Очистка","/ХВС/Подвоз воды :: /ХВС/Сбыт/Техническая :: /ХВС/Сбыт/Питьевая :: /ХВС/Транспортировка/Техническая :: /ХВС/Транспортировка/Питьевая :: /ХВС/Производство/Техническая :: /ХВС/Производство/Питьевая :: /ХВС/Очистка",null,null,"15-09-2008 00:00:00","31-12-2017 00:00:00"]
[487,"Республика Башкортостан","Чекмагушевский муниципальный район","80656000","Чекмагушевский сельский совет","80656470","28487276","Чекмагушевское МУП по водоснабжению","0249005215","024901001","Оказание услуг в сфере водоснабжения","Подвоз воды :: Техническая :: Питьевая :: Техническая :: Питьевая :: Техническая :: Питьевая :: Очистка","/ХВС/Подвоз воды :: /ХВС/Сбыт/Техническая :: /ХВС/Сбыт/Питьевая :: /ХВС/Транспортировка/Техническая :: /ХВС/Транспортировка/Питьевая :: /ХВС/Производство/Техническая :: /ХВС/Производство/Питьевая :: /ХВС/Очистка","25-02-2014 00:00:00",null,"25-02-2014 00:00:00"]
[488,"Республика Башкортостан","Чишминский муниципальный район","80657000","Алкинский сельский совет","80657405","30335229","АО \"ГУ ЖКХ\"","5116000922","770401001","Оказание услуг в сфере водоснабжения","Питьевая","/ХВС/Производство/Питьевая",null,null,"08-10-2015 00:00:00","31-12-2017 00:00:00"]
[489,"Республика Башкортостан","Чишминский муниципальный район","80657000","Алкинский сельский совет","80657405","30335229","АО \"ГУ ЖКХ\"","5116000922","770401001","Транспортировка воды","Питьевая","/ХВС/Транспортировка/Питьевая",null,null,"31-01-2017 00:00:00","31-12-2017 00:00:00"]
[490,"Республика Башкортостан","Чишминский муниципальный район","80657000","Алкинский сельский совет","80657405","30791606","АО \"ГУ ЖКХ\"","5116000922","166045001","Оказание услуг в сфере водоснабжения","Питьевая","/ХВС/Производство/Питьевая",null,null,"02-09-2016 00:00:00","31-12-2017 00:00:00"]
[491,"Республика Башкортостан","Чишминский муниципальный район","80657000","Алкинский сельский совет","80657405","26812367","Куйбышевская дирекция  по тепловодоснабжению структурное подразделение Центральной дирекции по тепловодоснабжению филиала ПАО «РЖД»","7708503727","631145034","Оказание услуг в сфере водоснабжения","Питьевая :: Питьевая :: Питьевая","/ХВС/Сбыт/Питьевая :: /ХВС/Транспортировка/Питьевая :: /ХВС/Производство/Питьевая",null,null,"31-12-2017 00:00:00","31-12-2017 00:00:00"]
[492,"Республика Башкортостан","Чишминский муниципальный район","80657000","Алкинский сельский совет","80657405","26812367","Куйбышевская дирекция  по тепловодоснабжению структурное подразделение Центральной дирекции по тепловодоснабжению филиала ПАО «РЖД»","7708503727","631145034","Транспортировка воды","Питьевая :: Питьевая :: Питьевая","/ХВС/Сбыт/Питьевая :: /ХВС/Транспортировка/Питьевая :: /ХВС/Производство/Питьевая",null,null,"31-12-2017 00:00:00","31-12-2017 00:00:00"]
[493,"Республика Башкортостан","Чишминский муниципальный район","80657000","Лесной сельский совет","80657446","30335229","АО \"ГУ ЖКХ\"","5116000922","770401001","Транспортировка воды","Питьевая","/ХВС/Транспортировка/Питьевая",null,null,"31-01-2017 00:00:00","31-12-2017 00:00:00"]
[494,"Республика Башкортостан","Чишминский муниципальный район","80657000","Чишминский поссовет","80657151","26812367","Куйбышевская дирекция  по тепловодоснабжению структурное подразделение Центральной дирекции по тепловодоснабжению филиала ПАО «РЖД»","7708503727","631145034","Оказание услуг в сфере водоснабжения","Питьевая :: Питьевая :: Питьевая","/ХВС/Сбыт/Питьевая :: /ХВС/Транспортировка/Питьевая :: /ХВС/Производство/Питьевая",null,null,"31-12-2017 00:00:00","31-12-2017 00:00:00"]
[495,"Республика Башкортостан","Чишминский муниципальный район","80657000","Чишминский поссовет","80657151","26812367","Куйбышевская дирекция  по тепловодоснабжению структурное подразделение Центральной дирекции по тепловодоснабжению филиала ПАО «РЖД»","7708503727","631145034","Транспортировка воды","Питьевая :: Питьевая :: Питьевая","/ХВС/Сбыт/Питьевая :: /ХВС/Транспортировка/Питьевая :: /ХВС/Производство/Питьевая",null,null,"31-12-2017 00:00:00","31-12-2017 00:00:00"]
[496,"Республика Башкортостан","Чишминский муниципальный район","80657000","Чишминский поссовет","80657151","26472492","ООО \"Чишмывода\"","0250012070","025001001","Оказание услуг в сфере водоснабжения","Подвоз воды :: Техническая :: Питьевая :: Техническая :: Питьевая :: Техническая :: Питьевая :: Очистка","/ХВС/Подвоз воды :: /ХВС/Сбыт/Техническая :: /ХВС/Сбыт/Питьевая :: /ХВС/Транспортировка/Техническая :: /ХВС/Транспортировка/Питьевая :: /ХВС/Производство/Техническая :: /ХВС/Производство/Питьевая :: /ХВС/Очистка",null,null,"15-01-2010 00:00:00"]
[497,"Республика Башкортостан","Чишминский муниципальный район","80657000","Шингак-Кульский сельский совет","80657475","26812367","Куйбышевская дирекция  по тепловодоснабжению структурное подразделение Центральной дирекции по тепловодоснабжению филиала ПАО «РЖД»","7708503727","631145034","Транспортировка воды","Питьевая :: Питьевая :: Питьевая","/ХВС/Сбыт/Питьевая :: /ХВС/Транспортировка/Питьевая :: /ХВС/Производство/Питьевая",null,null,"31-12-2017 00:00:00","31-12-2017 00:00:00"]
[498,"Республика Башкортостан","Чишминский муниципальный район","80657000","Шингак-Кульский сельский совет","80657475","26812367","Куйбышевская дирекция  по тепловодоснабжению структурное подразделение Центральной дирекции по тепловодоснабжению филиала ПАО «РЖД»","7708503727","631145034","Оказание услуг в сфере водоснабжения","Питьевая :: Питьевая :: Питьевая","/ХВС/Сбыт/Питьевая :: /ХВС/Транспортировка/Питьевая :: /ХВС/Производство/Питьевая",null,null,"31-12-2017 00:00:00","31-12-2017 00:00:00"]
[499,"Республика Башкортостан","Шаранский муниципальный район","80658000","Дюртюлинский сельский совет","80658420","27916300","МУП \"Водоканал\" (Шаранский)","0251006470","025101001","Транспортировка воды","Подвоз воды :: Питьевая :: Питьевая :: Питьевая","/ХВС/Подвоз воды :: /ХВС/Сбыт/Питьевая :: /ХВС/Транспортировка/Питьевая :: /ХВС/Производство/Питьевая","26-10-2012 00:00:00",null,"10-10-2016 00:00:00"]
[500,"Республика Башкортостан","Шаранский муниципальный район","80658000","Дюртюлинский сельский совет","80658420","27916300","МУП \"Водоканал\" (Шаранский)","0251006470","025101001","Оказание услуг в сфере водоснабжения","Подвоз воды :: Питьевая :: Питьевая :: Питьевая","/ХВС/Подвоз воды :: /ХВС/Сбыт/Питьевая :: /ХВС/Транспортировка/Питьевая :: /ХВС/Производство/Питьевая","26-10-2012 00:00:00",null,"10-10-2016 00:00:00"]
[501,"Республика Башкортостан","Шаранский муниципальный район","80658000","Мичуринский сельский совет","80658430","27916300","МУП \"Водоканал\" (Шаранский)","0251006470","025101001","Оказание услуг в сфере водоснабжения","Подвоз воды :: Техническая :: Питьевая :: Техническая :: Питьевая :: Техническая :: Питьевая :: Очистка","/ХВС/Подвоз воды :: /ХВС/Сбыт/Техническая :: /ХВС/Сбыт/Питьевая :: /ХВС/Транспортировка/Техническая :: /ХВС/Транспортировка/Питьевая :: /ХВС/Производство/Техническая :: /ХВС/Производство/Питьевая :: /ХВС/Очистка","26-10-2012 00:00:00",null,"15-03-2016 00:00:00"]
[502,"Республика Башкортостан","Шаранский муниципальный район","80658000","Шаранский сельский совет","80658485","27916300","МУП \"Водоканал\" (Шаранский)","0251006470","025101001","Оказание услуг в сфере водоснабжения","Подвоз воды :: Техническая :: Питьевая :: Техническая :: Питьевая :: Техническая :: Питьевая :: Очистка","/ХВС/Подвоз воды :: /ХВС/Сбыт/Техническая :: /ХВС/Сбыт/Питьевая :: /ХВС/Транспортировка/Техническая :: /ХВС/Транспортировка/Питьевая :: /ХВС/Производство/Техническая :: /ХВС/Производство/Питьевая :: /ХВС/Очистка","26-10-2012 00:00:00",null,"26-10-2012 00:00:00"]
[503,"Республика Башкортостан","Янаульский муниципальный район","80659000","Асавдыбашский сельский совет","80659410","31014979","ООО \"Тепловодоснабжение\"","0271055187","027101001","Оказание услуг в сфере водоснабжения","Подвоз воды :: Техническая :: Питьевая :: Техническая :: Питьевая :: Техническая :: Питьевая :: Очистка","/ХВС/Подвоз воды :: /ХВС/Сбыт/Техническая :: /ХВС/Сбыт/Питьевая :: /ХВС/Транспортировка/Техническая :: /ХВС/Транспортировка/Питьевая :: /ХВС/Производство/Техническая :: /ХВС/Производство/Питьевая :: /ХВС/Очистка","26-12-2017 00:00:00",null,"26-12-2017 00:00:00"]
[504,"Республика Башкортостан","Янаульский муниципальный район","80659000","Байгузинский сельский совет","80659415","31014979","ООО \"Тепловодоснабжение\"","0271055187","027101001","Оказание услуг в сфере водоснабжения","Подвоз воды :: Техническая :: Питьевая :: Техническая :: Питьевая :: Техническая :: Питьевая :: Очистка","/ХВС/Подвоз воды :: /ХВС/Сбыт/Техническая :: /ХВС/Сбыт/Питьевая :: /ХВС/Транспортировка/Техническая :: /ХВС/Транспортировка/Питьевая :: /ХВС/Производство/Техническая :: /ХВС/Производство/Питьевая :: /ХВС/Очистка","26-12-2017 00:00:00",null,"26-12-2017 00:00:00"]
[505,"Республика Башкортостан","Янаульский муниципальный район","80659000","Воядинский сельский совет","80659420","31014979","ООО \"Тепловодоснабжение\"","0271055187","027101001","Оказание услуг в сфере водоснабжения","Подвоз воды :: Техническая :: Питьевая :: Техническая :: Питьевая :: Техническая :: Питьевая :: Очистка","/ХВС/Подвоз воды :: /ХВС/Сбыт/Техническая :: /ХВС/Сбыт/Питьевая :: /ХВС/Транспортировка/Техническая :: /ХВС/Транспортировка/Питьевая :: /ХВС/Производство/Техническая :: /ХВС/Производство/Питьевая :: /ХВС/Очистка","26-12-2017 00:00:00",null,"26-12-2017 00:00:00"]
[506,"Республика Башкортостан","Янаульский муниципальный район","80659000","Город Янаул","80659101","26771843","ММУП \"Теплоэнергосервис\" МР Янаульский район РБ","0271009208","027101001","Оказание услуг в сфере водоснабжения","Подвоз воды :: Техническая :: Питьевая :: Техническая :: Питьевая :: Техническая :: Питьевая :: Очистка","/ХВС/Подвоз воды :: /ХВС/Сбыт/Техническая :: /ХВС/Сбыт/Питьевая :: /ХВС/Транспортировка/Техническая :: /ХВС/Транспортировка/Питьевая :: /ХВС/Производство/Техническая :: /ХВС/Производство/Питьевая :: /ХВС/Очистка",null,null,"10-02-2011 00:00:00","31-12-2017 00:00:00"]
[507,"Республика Башкортостан","Янаульский муниципальный район","80659000","Город Янаул","80659101","26754510","ООО  «ЯнаулВодоканал» г.Янаул РБ","0271009046","027101001","Оказание услуг в сфере водоснабжения","Подвоз воды :: Техническая :: Питьевая :: Техническая :: Питьевая :: Техническая :: Питьевая :: Очистка","/ХВС/Подвоз воды :: /ХВС/Сбыт/Техническая :: /ХВС/Сбыт/Питьевая :: /ХВС/Транспортировка/Техническая :: /ХВС/Транспортировка/Питьевая :: /ХВС/Производство/Техническая :: /ХВС/Производство/Питьевая :: /ХВС/Очистка",null,null,"26-01-2011 00:00:00"]
[508,"Республика Башкортостан","Янаульский муниципальный район","80659000","Город Янаул","80659101","31014979","ООО \"Тепловодоснабжение\"","0271055187","027101001","Оказание услуг в сфере водоснабжения","Подвоз воды :: Техническая :: Питьевая :: Техническая :: Питьевая :: Техническая :: Питьевая :: Очистка","/ХВС/Подвоз воды :: /ХВС/Сбыт/Техническая :: /ХВС/Сбыт/Питьевая :: /ХВС/Транспортировка/Техническая :: /ХВС/Транспортировка/Питьевая :: /ХВС/Производство/Техническая :: /ХВС/Производство/Питьевая :: /ХВС/Очистка","26-12-2017 00:00:00",null,"26-12-2017 00:00:00"]
[509,"Республика Башкортостан","Янаульский муниципальный район","80659000","Ижболдинский сельский совет","80659430","31014979","ООО \"Тепловодоснабжение\"","0271055187","027101001","Оказание услуг в сфере водоснабжения","Подвоз воды :: Техническая :: Питьевая :: Техническая :: Питьевая :: Техническая :: Питьевая :: Очистка","/ХВС/Подвоз воды :: /ХВС/Сбыт/Техническая :: /ХВС/Сбыт/Питьевая :: /ХВС/Транспортировка/Техническая :: /ХВС/Транспортировка/Питьевая :: /ХВС/Производство/Техническая :: /ХВС/Производство/Питьевая :: /ХВС/Очистка","26-12-2017 00:00:00",null,"26-12-2017 00:00:00"]
[510,"Республика Башкортостан","Янаульский муниципальный район","80659000","Истякский сельский совет","80659435","31014979","ООО \"Тепловодоснабжение\"","0271055187","027101001","Оказание услуг в сфере водоснабжения","Подвоз воды :: Техническая :: Питьевая :: Техническая :: Питьевая :: Техническая :: Питьевая :: Очистка","/ХВС/Подвоз воды :: /ХВС/Сбыт/Техническая :: /ХВС/Сбыт/Питьевая :: /ХВС/Транспортировка/Техническая :: /ХВС/Транспортировка/Питьевая :: /ХВС/Производство/Техническая :: /ХВС/Производство/Питьевая :: /ХВС/Очистка","26-12-2017 00:00:00",null,"26-12-2017 00:00:00"]
[511,"Республика Башкортостан","Янаульский муниципальный район","80659000","Иткинеевский сельский совет","80659440","31014979","ООО \"Тепловодоснабжение\"","0271055187","027101001","Оказание услуг в сфере водоснабжения","Подвоз воды :: Техническая :: Питьевая :: Техническая :: Питьевая :: Техническая :: Питьевая :: Очистка","/ХВС/Подвоз воды :: /ХВС/Сбыт/Техническая :: /ХВС/Сбыт/Питьевая :: /ХВС/Транспортировка/Техническая :: /ХВС/Транспортировка/Питьевая :: /ХВС/Производство/Техническая :: /ХВС/Производство/Питьевая :: /ХВС/Очистка","26-12-2017 00:00:00",null,"26-12-2017 00:00:00"]
[512,"Республика Башкортостан","Янаульский муниципальный район","80659000","Кармановский сельский совет","80659445","31014979","ООО \"Тепловодоснабжение\"","0271055187","027101001","Оказание услуг в сфере водоснабжения","Подвоз воды :: Техническая :: Питьевая :: Техническая :: Питьевая :: Техническая :: Питьевая :: Очистка","/ХВС/Подвоз воды :: /ХВС/Сбыт/Техническая :: /ХВС/Сбыт/Питьевая :: /ХВС/Транспортировка/Техническая :: /ХВС/Транспортировка/Питьевая :: /ХВС/Производство/Техническая :: /ХВС/Производство/Питьевая :: /ХВС/Очистка","26-12-2017 00:00:00",null,"26-12-2017 00:00:00"]
[513,"Республика Башкортостан","Янаульский муниципальный район","80659000","Кисак-Каинский сельский совет","80659450","31014979","ООО \"Тепловодоснабжение\"","0271055187","027101001","Оказание услуг в сфере водоснабжения","Подвоз воды :: Техническая :: Питьевая :: Техническая :: Питьевая :: Техническая :: Питьевая :: Очистка","/ХВС/Подвоз воды :: /ХВС/Сбыт/Техническая :: /ХВС/Сбыт/Питьевая :: /ХВС/Транспортировка/Техническая :: /ХВС/Транспортировка/Питьевая :: /ХВС/Производство/Техническая :: /ХВС/Производство/Питьевая :: /ХВС/Очистка","26-12-2017 00:00:00",null,"26-12-2017 00:00:00"]
[514,"Республика Башкортостан","Янаульский муниципальный район","80659000","Максимовский сельский совет","80659453","31014979","ООО \"Тепловодоснабжение\"","0271055187","027101001","Оказание услуг в сфере водоснабжения","Подвоз воды :: Техническая :: Питьевая :: Техническая :: Питьевая :: Техническая :: Питьевая :: Очистка","/ХВС/Подвоз воды :: /ХВС/Сбыт/Техническая :: /ХВС/Сбыт/Питьевая :: /ХВС/Транспортировка/Техническая :: /ХВС/Транспортировка/Питьевая :: /ХВС/Производство/Техническая :: /ХВС/Производство/Питьевая :: /ХВС/Очистка","26-12-2017 00:00:00",null,"26-12-2017 00:00:00"]
[515,"Республика Башкортостан","Янаульский муниципальный район","80659000","Месягутовский сельский совет","80659455","31014979","ООО \"Тепловодоснабжение\"","0271055187","027101001","Оказание услуг в сфере водоснабжения","Подвоз воды :: Техническая :: Питьевая :: Техническая :: Питьевая :: Техническая :: Питьевая :: Очистка","/ХВС/Подвоз воды :: /ХВС/Сбыт/Техническая :: /ХВС/Сбыт/Питьевая :: /ХВС/Транспортировка/Техническая :: /ХВС/Транспортировка/Питьевая :: /ХВС/Производство/Техническая :: /ХВС/Производство/Питьевая :: /ХВС/Очистка","26-12-2017 00:00:00",null,"26-12-2017 00:00:00"]
[516,"Республика Башкортостан","Янаульский муниципальный район","80659000","Новоартаульский сельский совет","80659460","31014979","ООО \"Тепловодоснабжение\"","0271055187","027101001","Оказание услуг в сфере водоснабжения","Подвоз воды :: Техническая :: Питьевая :: Техническая :: Питьевая :: Техническая :: Питьевая :: Очистка","/ХВС/Подвоз воды :: /ХВС/Сбыт/Техническая :: /ХВС/Сбыт/Питьевая :: /ХВС/Транспортировка/Техническая :: /ХВС/Транспортировка/Питьевая :: /ХВС/Производство/Техническая :: /ХВС/Производство/Питьевая :: /ХВС/Очистка","26-12-2017 00:00:00",null,"26-12-2017 00:00:00"]
[517,"Республика Башкортостан","Янаульский муниципальный район","80659000","Орловский сельский совет","80659465","31014979","ООО \"Тепловодоснабжение\"","0271055187","027101001","Оказание услуг в сфере водоснабжения","Подвоз воды :: Техническая :: Питьевая :: Техническая :: Питьевая :: Техническая :: Питьевая :: Очистка","/ХВС/Подвоз воды :: /ХВС/Сбыт/Техническая :: /ХВС/Сбыт/Питьевая :: /ХВС/Транспортировка/Техническая :: /ХВС/Транспортировка/Питьевая :: /ХВС/Производство/Техническая :: /ХВС/Производство/Питьевая :: /ХВС/Очистка","26-12-2017 00:00:00",null,"26-12-2017 00:00:00"]
[518,"Республика Башкортостан","Янаульский муниципальный район","80659000","Первомайский сельский совет","80659470","31014979","ООО \"Тепловодоснабжение\"","0271055187","027101001","Оказание услуг в сфере водоснабжения","Подвоз воды :: Техническая :: Питьевая :: Техническая :: Питьевая :: Техническая :: Питьевая :: Очистка","/ХВС/Подвоз воды :: /ХВС/Сбыт/Техническая :: /ХВС/Сбыт/Питьевая :: /ХВС/Транспортировка/Техническая :: /ХВС/Транспортировка/Питьевая :: /ХВС/Производство/Техническая :: /ХВС/Производство/Питьевая :: /ХВС/Очистка","26-12-2017 00:00:00",null,"26-12-2017 00:00:00"]
[519,"Республика Башкортостан","Янаульский муниципальный район","80659000","Сандугачевский сельский совет","80659475","31014979","ООО \"Тепловодоснабжение\"","0271055187","027101001","Оказание услуг в сфере водоснабжения","Подвоз воды :: Техническая :: Питьевая :: Техническая :: Питьевая :: Техническая :: Питьевая :: Очистка","/ХВС/Подвоз воды :: /ХВС/Сбыт/Техническая :: /ХВС/Сбыт/Питьевая :: /ХВС/Транспортировка/Техническая :: /ХВС/Транспортировка/Питьевая :: /ХВС/Производство/Техническая :: /ХВС/Производство/Питьевая :: /ХВС/Очистка","26-12-2017 00:00:00",null,"26-12-2017 00:00:00"]
[520,"Республика Башкортостан","Янаульский муниципальный район","80659000","Староваряшский сельский совет","80659480","31014979","ООО \"Тепловодоснабжение\"","0271055187","027101001","Оказание услуг в сфере водоснабжения","Подвоз воды :: Техническая :: Питьевая :: Техническая :: Питьевая :: Техническая :: Питьевая :: Очистка","/ХВС/Подвоз воды :: /ХВС/Сбыт/Техническая :: /ХВС/Сбыт/Питьевая :: /ХВС/Транспортировка/Техническая :: /ХВС/Транспортировка/Питьевая :: /ХВС/Производство/Техническая :: /ХВС/Производство/Питьевая :: /ХВС/Очистка","26-12-2017 00:00:00",null,"26-12-2017 00:00:00"]
[521,"Республика Башкортостан","Янаульский муниципальный район","80659000","Старокудашевский сельский совет","80659485","31014979","ООО \"Тепловодоснабжение\"","0271055187","027101001","Оказание услуг в сфере водоснабжения","Подвоз воды :: Техническая :: Питьевая :: Техническая :: Питьевая :: Техническая :: Питьевая :: Очистка","/ХВС/Подвоз воды :: /ХВС/Сбыт/Техническая :: /ХВС/Сбыт/Питьевая :: /ХВС/Транспортировка/Техническая :: /ХВС/Транспортировка/Питьевая :: /ХВС/Производство/Техническая :: /ХВС/Производство/Питьевая :: /ХВС/Очистка","26-12-2017 00:00:00",null,"26-12-2017 00:00:00"]
[522,"Республика Башкортостан","Янаульский муниципальный район","80659000","Шудекский сельский совет","80659490","31014979","ООО \"Тепловодоснабжение\"","0271055187","027101001","Оказание услуг в сфере водоснабжения","Подвоз воды :: Техническая :: Питьевая :: Техническая :: Питьевая :: Техническая :: Питьевая :: Очистка","/ХВС/Подвоз воды :: /ХВС/Сбыт/Техническая :: /ХВС/Сбыт/Питьевая :: /ХВС/Транспортировка/Техническая :: /ХВС/Транспортировка/Питьевая :: /ХВС/Производство/Техническая :: /ХВС/Производство/Питьевая :: /ХВС/Очистка","26-12-2017 00:00:00",null,"26-12-2017 00:00:00"]
[523,"Республика Башкортостан","Янаульский муниципальный район","80659000","Ямадинский сельский совет","80659495","31014979","ООО \"Тепловодоснабжение\"","0271055187","027101001","Оказание услуг в сфере водоснабжения","Подвоз воды :: Техническая :: Питьевая :: Техническая :: Питьевая :: Техническая :: Питьевая :: Очистка","/ХВС/Подвоз воды :: /ХВС/Сбыт/Техническая :: /ХВС/Сбыт/Питьевая :: /ХВС/Транспортировка/Техническая :: /ХВС/Транспортировка/Питьевая :: /ХВС/Производство/Техническая :: /ХВС/Производство/Питьевая :: /ХВС/Очистка","26-12-2017 00:00:00",null,"26-12-2017 00:00:00"]

{"sheet":"modGetGeoBase","index":15,"n_rows":0,"n_cols":0,"rows_kept":0,"hidden":true}

{"sheet":"REESTR_MO","index":16,"n_rows":896,"n_cols":6,"rows_kept":896,"hidden":true}
["МР","МО","ОКТМО","ТИП МО","МР","ИМЯ ДИАПАЗОНА"]
["Абзелиловский муниципальный район","Абзелиловский муниципальный район","80601000","муниципальный район","Абзелиловский муниципальный район","MO_LIST_2"]
["Абзелиловский муниципальный район","Альмухаметовский сельский совет","80601404","сельское поселение","Альшеевский муниципальный район","MO_LIST_3"]
["Абзелиловский муниципальный район","Амангильдинский сельский совет","80601407","сельское поселение","Архангельский муниципальный район","MO_LIST_4"]
["Абзелиловский муниципальный район","Аскаровский сельский совет","80601410","сельское поселение","Аскинский муниципальный район","MO_LIST_5"]
["Абзелиловский муниципальный район","Баимовский сельский совет","80601413","сельское поселение","Аургазинский муниципальный район","MO_LIST_6"]
["Абзелиловский муниципальный район","Бурангуловский сельский совет","80601416","сельское поселение","Баймакский муниципальный район","MO_LIST_7"]
["Абзелиловский муниципальный район","Гусевский сельский совет","80601419","сельское поселение","Бакалинский муниципальный район","MO_LIST_8"]
["Абзелиловский муниципальный район","Давлетовский сельский совет","80601422","сельское поселение","Балтачевский муниципальный район","MO_LIST_9"]
["Абзелиловский муниципальный район","Кирдасовский сельский совет","80601425","сельское поселение","Белебеевский муниципальный район","MO_LIST_10"]
["Абзелиловский муниципальный район","Краснобашкирский сельский совет","80601428","сельское поселение","Белокатайский муниципальный район","MO_LIST_11"]
["Абзелиловский муниципальный район","Равиловский сельский совет","80601431","сельское поселение","Белорецкий муниципальный район","MO_LIST_12"]
["Абзелиловский муниципальный район","Ташбулатовский сельский совет","80601434","сельское поселение","Бижбулякский муниципальный район","MO_LIST_13"]
["Абзелиловский муниципальный район","Таштимеровский сельский совет","80601437","сельское поселение","Бирский муниципальный район","MO_LIST_14"]
["Абзелиловский муниципальный район","Халиловский сельский совет","80601440","сельское поселение","Благоварский муниципальный район","MO_LIST_15"]
["Абзелиловский муниципальный район","Хамитовский сельский совет","80601443","сельское поселение","Благовещенский муниципальный район","MO_LIST_16"]
["Абзелиловский муниципальный район","Янгильский сельский совет","80601446","сельское поселение","Буздякский муниципальный район","MO_LIST_17"]
["Альшеевский муниципальный район","Абдрашитовский сельский совет","80602404","сельское поселение","Бураевский муниципальный район","MO_LIST_18"]
["Альшеевский муниципальный район","Аксеновский сельский совет","80602406","сельское поселение","Бурзянский муниципальный район","MO_LIST_19"]
["Альшеевский муниципальный район","Альшеевский муниципальный район","80602000","муниципальный район","Гафурийский муниципальный район","MO_LIST_20"]
["Альшеевский муниципальный район","Воздвиженский сельский совет","80602413","сельское поселение","Город Агидель","MO_LIST_21"]
["Альшеевский муниципальный район","Гайниямакский сельский совет","80602416","сельское поселение","Город Кумертау","MO_LIST_22"]
["Альшеевский муниципальный район","Зеленоклиновский сельский совет","80602418","сельское поселение","Город Нефтекамск","MO_LIST_23"]
["Альшеевский муниципальный район","Ибраевский сельский совет","80602419","сельское поселение","Город Октябрьский","MO_LIST_24"]
["Альшеевский муниципальный район","Казанский сельский совет","80602422","сельское поселение","Город Салават","MO_LIST_25"]
["Альшеевский муниципальный район","Кармышевский сельский совет","80602428","сельское поселение","Город Сибай","MO_LIST_26"]
["Альшеевский муниципальный район","Кипчак-Аскаровский сельский совет","80602431","сельское поселение","Город Стерлитамак","MO_LIST_27"]
["Альшеевский муниципальный район","Кызыльский сельский совет","80602437","сельское поселение","Город Уфа","MO_LIST_28"]
["Альшеевский муниципальный район","Мендяновский сельский совет","80602440","сельское поселение","Давлекановский муниципальный район","MO_LIST_29"]
["Альшеевский муниципальный район","Нигматуллинский сельский совет","80602443","сельское поселение","Дуванский муниципальный район","MO_LIST_30"]
["Альшеевский муниципальный район","Нижнеаврюзовский сельский совет","80602446","сельское поселение","Дюртюлинский муниципальный район","MO_LIST_31"]
["Альшеевский муниципальный район","Никифаровский сельский совет","80602449","сельское поселение","Ермекеевский муниципальный район","MO_LIST_32"]
["Альшеевский муниципальный район","Раевский сельский совет","80602451","сельское поселение","ЗАТО город Межгорье","MO_LIST_33"]
["Альшеевский муниципальный район","Слаковский сельский совет","80602455","сельское поселение","Зианчуринский муниципальный район","MO_LIST_34"]
["Альшеевский муниципальный район","Ташлинский сельский совет","80602458","сельское поселение","Зилаирский муниципальный район","MO_LIST_35"]
["Альшеевский муниципальный район","Трунтаишевский сельский совет","80602461","сельское поселение","Иглинский муниципальный район","MO_LIST_36"]
["Альшеевский муниципальный район","Чебенлинский сельский совет","80602464","сельское поселение","Илишевский муниципальный район","MO_LIST_37"]
["Альшеевский муниципальный район","Шафрановский сельский совет","80602470","сельское поселение","Ишимбайский муниципальный район","MO_LIST_38"]
["Архангельский муниципальный район","Абзановский сельский совет","80603404","сельское поселение","Калтасинский муниципальный район","MO_LIST_39"]
["Архангельский муниципальный район","Арх-Латышский сельский совет","80603413","сельское поселение","Караидельский муниципальный район","MO_LIST_40"]
["Архангельский муниципальный район","Архангельский муниципальный район","80603000","муниципальный район","Кармаскалинский муниципальный район","MO_LIST_41"]
["Архангельский муниципальный район","Архангельский сельский совет","80603410","сельское поселение","Кигинский муниципальный район","MO_LIST_42"]
["Архангельский муниципальный район","Бакалдинский сельский совет","80603416","сельское поселение","Краснокамский муниципальный район","MO_LIST_43"]
["Архангельский муниципальный район","Инзерский сельский совет","80603419","сельское поселение","Кугарчинский муниципальный район","MO_LIST_44"]
["Архангельский муниципальный район","Ирныкшинский сельский совет","80603422","сельское поселение","Кушнаренковский муниципальный район","MO_LIST_45"]
["Архангельский муниципальный район","Краснозилимский сельский совет","80603425","сельское поселение","Куюргазинский муниципальный район","MO_LIST_46"]
["Архангельский муниципальный район","Краснокуртовский сельский совет","80603428","сельское поселение","Мелеузовский муниципальный район","MO_LIST_47"]
["Архангельский муниципальный район","Липовский сельский совет","80603434","сельское поселение","Мечетлинский муниципальный район","MO_LIST_48"]
["Архангельский муниципальный район","Орловский сельский совет","80603440","сельское поселение","Мишкинский муниципальный район","MO_LIST_49"]
["Архангельский муниципальный район","Тавакачевский сельский совет","80603446","сельское поселение","Миякинский муниципальный район","MO_LIST_50"]
["Архангельский муниципальный район","Узунларовский сельский совет","80603450","сельское поселение","Нуримановский муниципальный район","MO_LIST_51"]
["Аскинский муниципальный район","Арбашевский сельский совет","80604402","сельское поселение","Салаватский муниципальный район","MO_LIST_52"]
["Аскинский муниципальный район","Аскинский муниципальный район","80604000","муниципальный район","Стерлибашевский муниципальный район","MO_LIST_53"]
["Аскинский муниципальный район","Аскинский сельский совет","80604404","сельское поселение","Стерлитамакский муниципальный район","MO_LIST_54"]
["Аскинский муниципальный район","Евбулякский сельский совет","80604413","сельское поселение","Татышлинский муниципальный район","MO_LIST_55"]
["Аскинский муниципальный район","Казанчинский сельский совет","80604416","сельское поселение","Туймазинский муниципальный район","MO_LIST_56"]
["Аскинский муниципальный район","Карткисяковский сельский совет","80604418","сельское поселение","Уфимский муниципальный район","MO_LIST_57"]
["Аскинский муниципальный район","Кашкинский сельский совет","80604419","сельское поселение","Учалинский муниципальный район","MO_LIST_58"]
["Аскинский муниципальный район","Ключевский сельский совет","80604425","сельское поселение","Федоровский муниципальный район","MO_LIST_59"]
["Аскинский муниципальный район","Кубиязовский сельский совет","80604428","сельское поселение","Хайбуллинский муниципальный район","MO_LIST_60"]
["Аскинский муниципальный район","Кунгаковский сельский совет","80604431","сельское поселение","Чекмагушевский муниципальный район","MO_LIST_61"]
["Аскинский муниципальный район","Кшлау-Елгинский сельский совет","80604437","сельское поселение","Чишминский муниципальный район","MO_LIST_62"]
["Аскинский муниципальный район","Мутабашевский сельский совет","80604440","сельское поселение","Шаранский муниципальный район","MO_LIST_63"]
["Аскинский муниципальный район","Петропавловский сельский совет","80604442","сельское поселение","Янаульский муниципальный район","MO_LIST_64"]
["Аскинский муниципальный район","Султанбековский сельский совет","80604443","сельское поселение"]
["Аскинский муниципальный район","Урмиязовский сельский совет","80604446","сельское поселение"]
["Аскинский муниципальный район","Усть-Табасский сельский совет","80604450","сельское поселение"]
["Аургазинский муниципальный район","Аургазинский муниципальный район","80605000","муниципальный район"]
["Аургазинский муниципальный район","Балыклыкульский сельский совет","80605402","сельское поселение"]
["Аургазинский муниципальный район","Батыровский сельский совет","80605404","сельское поселение"]
["Аургазинский муниципальный район","Бишкаинский сельский совет","80605407","сельское поселение"]
["Аургазинский муниципальный район","Ибраевский сельский совет","80605410","сельское поселение"]
["Аургазинский муниципальный район","Исмагиловский сельский совет","80605413","сельское поселение"]
["Аургазинский муниципальный район","Ишлинский сельский совет","80605416","сельское поселение"]
["Аургазинский муниципальный район","Кебячевский сельский совет","80605419","сельское поселение"]
["Аургазинский муниципальный район","Меселинский сельский совет","80605422","сельское поселение"]
["Аургазинский муниципальный район","Михайловский сельский совет","80605425","сельское поселение"]
["Аургазинский муниципальный район","Нагадакский сельский совет","80605428","сельское поселение"]
["Аургазинский муниципальный район","Новокальчировский сельский совет","80605431","сельское поселение"]
["Аургазинский муниципальный район","Семенкинский сельский совет","80605434","сельское поселение"]
["Аургазинский муниципальный район","Степановский сельский совет","80605437","сельское поселение"]
["Аургазинский муниципальный район","Султанмуратовский сельский совет","80605440","сельское поселение"]
["Аургазинский муниципальный район","Таштамакский сельский совет","80605443","сельское поселение"]
["Аургазинский муниципальный район","Толбазинский сельский совет","80605446","сельское поселение"]
["Аургазинский муниципальный район","Тряпинский сельский совет","80605449","сельское поселение"]
["Аургазинский муниципальный район","Тукаевский сельский совет","80605452","сельское поселение"]
["Аургазинский муниципальный район","Турумбетовский сельский совет","80605458","сельское поселение"]
["Аургазинский муниципальный район","Уршакский сельский совет","80605461","сельское поселение"]
["Аургазинский муниципальный район","Чуваш-Карамалинский сельский совет","80605472","сельское поселение"]
["Баймакский муниципальный район","1-й Иткуловский сельский совет","80606416","сельское поселение"]
["Баймакский муниципальный район","Абдулкаримовский сельский совет","80606404","сельское поселение"]
["Баймакский муниципальный район","Акмурунский сельский совет","80606407","сельское поселение"]
["Баймакский муниципальный район","Баймакский муниципальный район","80606000","муниципальный район"]
["Баймакский муниципальный район","Бекешевский сельский совет","80606409","сельское поселение"]
["Баймакский муниципальный район","Биляловский сельский совет","80606410","сельское поселение"]
["Баймакский муниципальный район","Город Баймак","80606101","городское поселение, в состав которого входит город"]
["Баймакский муниципальный район","Зилаирский сельский совет","80606413","сельское поселение"]
["Баймакский муниципальный район","Ишбердинский сельский совет","80606428","сельское поселение"]
["Баймакский муниципальный район","Ишмурзинский сельский совет","80606422","сельское поселение"]
["Баймакский муниципальный район","Ишмухаметовский сельский совет","80606425","сельское поселение"]
["Баймакский муниципальный район","Кульчуровский сельский совет","80606437","сельское поселение"]
["Баймакский муниципальный район","Кусеевский сельский совет","80606431","сельское поселение"]
["Баймакский муниципальный район","Мерясовский сельский совет","80606438","сельское поселение"]
["Баймакский муниципальный район","Мукасовский сельский совет","80606434","сельское поселение"]
["Баймакский муниципальный район","Нигаматовский сельский совет","80606440","сельское поселение"]
["Баймакский муниципальный район","Семеновский сельский совет","80606442","сельское поселение"]
["Баймакский муниципальный район","Сибайский сельский совет","80606443","сельское поселение"]
["Баймакский муниципальный район","Тавлыкаевский сельский совет","80606446","сельское поселение"]
["Баймакский муниципальный район","Татлыбаевский сельский совет","80606449","сельское поселение"]
["Баймакский муниципальный район","Темясовский сельский совет","80606452","сельское поселение"]
["Баймакский муниципальный район","Тубинский сельский совет","80606453","сельское поселение"]
["Баймакский муниципальный район","Юмашевский сельский совет","80606455","сельское поселение"]
["Баймакский муниципальный район","Яратовский сельский совет","80606459","сельское поселение"]
["Бакалинский муниципальный район","Ахмановский сельский совет","80607404","сельское поселение"]
["Бакалинский муниципальный район","Бакалинский муниципальный район","80607000","муниципальный район"]
["Бакалинский муниципальный район","Бакалинский сельский совет","80607407","сельское поселение"]
["Бакалинский муниципальный район","Бузюровский сельский совет","80607413","сельское поселение"]
["Бакалинский муниципальный район","Дияшевский сельский совет","80607419","сельское поселение"]
["Бакалинский муниципальный район","Камышлытамакский сельский совет","80607425","сельское поселение"]
["Бакалинский муниципальный район","Килеевский сельский совет","80607428","сельское поселение"]
["Бакалинский муниципальный район","Куштиряковский сельский совет","80607431","сельское поселение"]
["Бакалинский муниципальный район","Михайловский сельский совет","80607410","сельское поселение"]
["Бакалинский муниципальный район","Мустафинский сельский совет","80607434","сельское поселение"]
["Бакалинский муниципальный район","Новокатаевский сельский совет","80607440","сельское поселение"]
["Бакалинский муниципальный район","Новоурсаевский сельский совет","80607446","сельское поселение"]
["Бакалинский муниципальный район","Старокостеевский сельский совет","80607451","сельское поселение"]
["Бакалинский муниципальный район","Старокуручевский сельский совет","80607449","сельское поселение"]
["Бакалинский муниципальный район","Староматинский сельский совет","80607455","сельское поселение"]
["Бакалинский муниципальный район","Старошарашлинский сельский совет","80607458","сельское поселение"]
["Бакалинский муниципальный район","Тактагуловский сельский совет","80607461","сельское поселение"]
["Бакалинский муниципальный район","Урманаевский сельский совет","80607464","сельское поселение"]
["Балтачевский муниципальный район","Балтачевский муниципальный район","80608000","муниципальный район"]
["Балтачевский муниципальный район","Богдановский сельский совет","80608404","сельское поселение"]
["Балтачевский муниципальный район","Верхнеянактаевский сельский совет","80608407","сельское поселение"]
["Балтачевский муниципальный район","Кундашлинский сельский совет","80608413","сельское поселение"]
["Балтачевский муниципальный район","Кунтугушевский сельский совет","80608416","сельское поселение"]
["Балтачевский муниципальный район","Нижнекарышевский сельский совет","80608419","сельское поселение"]
["Балтачевский муниципальный район","Нижнесикиязовский сельский совет","80608422","сельское поселение"]
["Балтачевский муниципальный район","Норкинский сельский совет","80608425","сельское поселение"]
["Балтачевский муниципальный район","Сейтяковский сельский совет","80608428","сельское поселение"]
["Балтачевский муниципальный район","Старобалтачевский сельский совет","80608431","сельское поселение"]
["Балтачевский муниципальный район","Староянбаевский сельский совет","80608434","сельское поселение"]
["Балтачевский муниципальный район","Тошкуровский сельский совет","80608437","сельское поселение"]
["Балтачевский муниципальный район","Тучубаевский сельский совет","80608440","сельское поселение"]
["Балтачевский муниципальный район","Шавьядинский сельский совет","80608441","сельское поселение"]
["Балтачевский муниципальный район","Штандинский сельский совет","80608443","сельское поселение"]
["Балтачевский муниципальный район","Ялангачевский сельский совет","80608448","сельское поселение"]
["Белебеевский муниципальный район","Аксаковский сельский совет","80609401","сельское поселение"]
["Белебеевский муниципальный район","Анновский сельский совет","80609413","сельское поселение"]
["Белебеевский муниципальный район","Баженовский сельский совет","80609402","сельское поселение"]
["Белебеевский муниципальный район","Белебеевский муниципальный район","80609000","муниципальный район"]
["Белебеевский муниципальный район","Город Белебей","80609101","городское поселение, в состав которого входит город"]
["Белебеевский муниципальный район","Донской сельский совет","80609404","сельское поселение"]
["Белебеевский муниципальный район","Ермолкинский сельский совет","80609407","сельское поселение"]
["Белебеевский муниципальный район","Знаменский сельский совет","80609410","сельское поселение"]
["Белебеевский муниципальный район","Максим-Горьковский сельский совет","80609416","сельское поселение"]
["Белебеевский муниципальный район","Малиновский сельский совет","80609419","сельское поселение"]
["Белебеевский муниципальный район","Метевбашевский сельский совет","80609425","сельское поселение"]
["Белебеевский муниципальный район","Приютовский поссовет","80609165","городское поселение, в состав которого входит поселок"]
["Белебеевский муниципальный район","Рассветовский сельский совет","80609428","сельское поселение"]
["Белебеевский муниципальный район","Семенкинский сельский совет","80609431","сельское поселение"]
["Белебеевский муниципальный район","Слакбашевский сельский совет","80609434","сельское поселение"]
["Белебеевский муниципальный район","Тузлукушевский сельский совет","80609437","сельское поселение"]
["Белебеевский муниципальный район","Усень-Ивановский сельский совет","80609440","сельское поселение"]
["Белебеевский муниципальный район","Шаровский сельский совет","80609443","сельское поселение"]
["Белокатайский муниципальный район","Атаршинский сельский совет","80610402","сельское поселение"]
["Белокатайский муниципальный район","Белокатайский муниципальный район","80610000","муниципальный район"]
["Белокатайский муниципальный район","Белянковский сельский совет","80610404","сельское поселение"]
["Белокатайский муниципальный район","Емашинский сельский совет","80610407","сельское поселение"]
["Белокатайский муниципальный район","Карлыхановский сельский совет","80610413","сельское поселение"]
["Белокатайский муниципальный район","Майгазинский сельский совет","80610416","сельское поселение"]
["Белокатайский муниципальный район","Нижнеискушинский сельский совет","80610419","сельское поселение"]
["Белокатайский муниципальный район","Новобелокатайский сельский совет","80610422","сельское поселение"]
["Белокатайский муниципальный район","Ногушинский сельский совет","80610425","сельское поселение"]
["Белокатайский муниципальный район","Старобелокатайский сельский совет","80610428","сельское поселение"]
["Белокатайский муниципальный район","Тардавский сельский совет","80610431","сельское поселение"]
["Белокатайский муниципальный район","Ургалинский сельский совет","80610434","сельское поселение"]
["Белокатайский муниципальный район","Утяшевский сельский совет","80610437","сельское поселение"]
["Белокатайский муниципальный район","Яныбаевский сельский совет","80610440","сельское поселение"]
["Белорецкий муниципальный район","Абзаковский сельский совет","80611404","сельское поселение"]
["Белорецкий муниципальный район","Азикеевский сельский совет","80611407","сельское поселение"]
["Белорецкий муниципальный район","Ассинский сельский совет","80611410","сельское поселение"]
["Белорецкий муниципальный район","Белорецкий муниципальный район","80611000","муниципальный район"]
["Белорецкий муниципальный район","Верхнеавзянский сельский совет","80611415","сельское поселение"]
["Белорецкий муниципальный район","Город Белорецк","80611101","городское поселение, в состав которого входит город"]
["Белорецкий муниципальный район","Железнодорожный сельский совет","80611418","сельское поселение"]
["Белорецкий муниципальный район","Зигазинский сельский совет","80611416","сельское поселение"]
["Белорецкий муниципальный район","Зуяковский сельский совет","80611417","сельское поселение"]
["Белорецкий муниципальный район","Инзерский сельский совет","80611420","сельское поселение"]
["Белорецкий муниципальный район","Ишлинский сельский совет","80611422","сельское поселение"]
["Белорецкий муниципальный район","Кагинский сельский совет","80611425","сельское поселение"]
["Белорецкий муниципальный район","Ломовский сельский совет","80611427","сельское поселение"]
["Белорецкий муниципальный район","Николаевский сельский совет","80611434","сельское поселение"]
["Белорецкий муниципальный район","Нурский сельский совет","80611440","сельское поселение"]
["Белорецкий муниципальный район","Серменевский сельский совет","80611443","сельское поселение"]
["Белорецкий муниципальный район","Сосновский сельский совет","80611446","сельское поселение"]
["Белорецкий муниципальный район","Тирлянский сельский совет","80611448","сельское поселение"]
["Белорецкий муниципальный район","Туканский сельский совет","80611449","сельское поселение"]
["Белорецкий муниципальный район","Узянский сельский совет","80611452","сельское поселение"]
["Белорецкий муниципальный район","Шигаевский сельский совет","80611455","сельское поселение"]
["Бижбулякский муниципальный район","Аитовский сельский совет","80612404","сельское поселение"]
["Бижбулякский муниципальный район","Базлыкский сельский совет","80612407","сельское поселение"]
["Бижбулякский муниципальный район","Бижбулякский муниципальный район","80612000","муниципальный район"]
["Бижбулякский муниципальный район","Бижбулякский сельский совет","80612410","сельское поселение"]
["Бижбулякский муниципальный район","Биккуловский сельский совет","80612413","сельское поселение"]
["Бижбулякский муниципальный район","Демский сельский совет","80612416","сельское поселение"]
["Бижбулякский муниципальный район","Елбулактамакский сельский совет","80612419","сельское поселение"]
["Бижбулякский муниципальный район","Зириклинский сельский совет","80612422","сельское поселение"]
["Бижбулякский муниципальный район","Калининский сельский совет","80612425","сельское поселение"]
["Бижбулякский муниципальный район","Каменский сельский совет","80612428","сельское поселение"]
["Бижбулякский муниципальный район","Кенгер-Менеузовский сельский совет","80612431","сельское поселение"]
["Бижбулякский муниципальный район","Кош-Елгинский сельский совет","80612440","сельское поселение"]
["Бижбулякский муниципальный район","Михайловский сельский совет","80612442","сельское поселение"]
["Бижбулякский муниципальный район","Сухореченский сельский совет","80612443","сельское поселение"]
["Бирский муниципальный район","Бахтыбаевский сельский совет","80613407","сельское поселение"]
["Бирский муниципальный район","Березовский сельский совет","80613409","сельское поселение"]
["Бирский муниципальный район","Бирский муниципальный район","80613000","муниципальный район"]
["Бирский муниципальный район","Бурновский сельский совет","80613408","сельское поселение"]
["Бирский муниципальный район","Верхнелачентауский сельский совет","80613410","сельское поселение"]
["Бирский муниципальный район","Город Бирск","80613101","городское поселение, в состав которого входит город"]
["Бирский муниципальный район","Калинниковский сельский совет","80613416","сельское поселение"]
["Бирский муниципальный район","Кусекеевский сельский совет","80613419","сельское поселение"]
["Бирский муниципальный район","Маядыковский сельский совет","80613422","сельское поселение"]
["Бирский муниципальный район","Осиновский сельский совет","80613425","сельское поселение"]
["Бирский муниципальный район","Силантьевский сельский совет","80613431","сельское поселение"]
["Бирский муниципальный район","Старобазановский сельский совет","80613434","сельское поселение"]
["Бирский муниципальный район","Старопетровский сельский совет","80613437","сельское поселение"]
["Бирский муниципальный район","Сусловский сельский совет","80613440","сельское поселение"]
["Бирский муниципальный район","Угузевский сельский совет","80613443","сельское поселение"]
["Бирский муниципальный район","Чишминский сельский совет","80613446","сельское поселение"]
["Благоварский муниципальный район","Алексеевский сельский совет","80614404","сельское поселение"]
["Благоварский муниципальный район","Балышлинский сельский совет","80614407","сельское поселение"]
["Благоварский муниципальный район","Благоварский муниципальный район","80614000","муниципальный район"]
["Благоварский муниципальный район","Благоварский сельский совет","80614410","сельское поселение"]
["Благоварский муниципальный район","Дмитриевский сельский совет","80614413","сельское поселение"]
["Благоварский муниципальный район","Каргалинский сельский совет","80614416","сельское поселение"]
["Благоварский муниципальный район","Кашкалашинский сельский совет","80614419","сельское поселение"]
["Благоварский муниципальный район","Кучербаевский сельский совет","80614422","сельское поселение"]
["Благоварский муниципальный район","Мирновский сельский совет","80614423","сельское поселение"]
["Благоварский муниципальный район","Первомайский сельский совет","80614424","сельское поселение"]
["Благоварский муниципальный район","Тановский сельский совет","80614428","сельское поселение"]
["Благоварский муниципальный район","Троицкий сельский совет","80614431","сельское поселение"]
["Благоварский муниципальный район","Удрякбашевский сельский совет","80614434","сельское поселение"]
["Благоварский муниципальный район","Языковский сельский совет","80614437","сельское поселение"]
["Благоварский муниципальный район","Ямакаевский сельский совет","80614440","сельское поселение"]
["Благоварский муниципальный район","Янышевский сельский совет","80614443","сельское поселение"]
["Благовещенский муниципальный район","Бедеево-Полянский сельский совет","80615404","сельское поселение"]
["Благовещенский муниципальный район","Благовещенский муниципальный район","80615000","муниципальный район"]
["Благовещенский муниципальный район","Богородский сельский совет","80615407","сельское поселение"]
["Благовещенский муниципальный район","Волковский сельский совет","80615413","сельское поселение"]
["Благовещенский муниципальный район","Город Благовещенск","80615101","городское поселение, в состав которого входит город"]
["Благовещенский муниципальный район","Изяковский сельский совет","80615419","сельское поселение"]
["Благовещенский муниципальный район","Иликовский сельский совет","80615422","сельское поселение"]
["Благовещенский муниципальный район","Ильино-Полянский сельский совет","80615425","сельское поселение"]
["Благовещенский муниципальный район","Николаевский сельский совет","80615428","сельское поселение"]
["Благовещенский муниципальный район","Новонадеждинский сельский совет","80615431","сельское поселение"]
["Благовещенский муниципальный район","Октябрьский сельский совет","80615434","сельское поселение"]
["Благовещенский муниципальный район","Орловский сельский совет","80615437","сельское поселение"]
["Благовещенский муниципальный район","Покровский сельский совет","80615440","сельское поселение"]
["Благовещенский муниципальный район","Саннинский сельский совет","80615443","сельское поселение"]
["Благовещенский муниципальный район","Старонадеждинский сельский совет","80615449","сельское поселение"]
["Благовещенский муниципальный район","Тугайский сельский совет","80615453","сельское поселение"]
["Благовещенский муниципальный район","Удельно-Дуванейский сельский совет","80615461","сельское поселение"]
["Буздякский муниципальный район","Арслановский сельский совет","80617404","сельское поселение"]
["Буздякский муниципальный район","Буздякский муниципальный район","80617000","муниципальный район"]
["Буздякский муниципальный район","Буздякский сельский совет","80617407","сельское поселение"]
["Буздякский муниципальный район","Гафурийский сельский совет","80617410","сельское поселение"]
["Буздякский муниципальный район","Канлы-Туркеевский сельский совет","80617413","сельское поселение"]
["Буздякский муниципальный район","Каранский сельский совет","80617416","сельское поселение"]
["Буздякский муниципальный район","Килимовский сельский совет","80617419","сельское поселение"]
["Буздякский муниципальный район","Копей-Кубовский сельский совет","80617422","сельское поселение"]
["Буздякский муниципальный район","Кузеевский сельский совет","80617425","сельское поселение"]
["Буздякский муниципальный район","Сабаевский сельский совет","80617431","сельское поселение"]
["Буздякский муниципальный район","Тавларовский сельский совет","80617437","сельское поселение"]
["Буздякский муниципальный район","Тюрюшевский сельский совет","80617440","сельское поселение"]
["Буздякский муниципальный район","Уртакульский сельский совет","80617446","сельское поселение"]
["Бураевский муниципальный район","Азяковский сельский совет","80618404","сельское поселение"]
["Бураевский муниципальный район","Бадраковский сельский совет","80618407","сельское поселение"]
["Бураевский муниципальный район","Бураевский муниципальный район","80618000","муниципальный район"]
["Бураевский муниципальный район","Бураевский сельский совет","80618413","сельское поселение"]
["Бураевский муниципальный район","Ванышевский сельский совет","80618416","сельское поселение"]
["Бураевский муниципальный район","Вострецовский сельский совет","80618419","сельское поселение"]
["Бураевский муниципальный район","Каинлыковский сельский совет","80618422","сельское поселение"]
["Бураевский муниципальный район","Кашкалевский сельский совет","80618425","сельское поселение"]
["Бураевский муниципальный район","Кузбаевский сельский совет","80618431","сельское поселение"]
["Бураевский муниципальный район","Кушманаковский сельский совет","80618428","сельское поселение"]
["Бураевский муниципальный район","Тазларовский сельский совет","80618437","сельское поселение"]
["Бураевский муниципальный район","Тангатаровский сельский совет","80618440","сельское поселение"]
["Бураевский муниципальный район","Тепляковский сельский совет","80618443","сельское поселение"]
["Бураевский муниципальный район","Челкаковский сельский совет","80618446","сельское поселение"]
["Бурзянский муниципальный район","Аскаровский сельский совет","80619404","сельское поселение"]
["Бурзянский муниципальный район","Атиковский сельский совет","80619407","сельское поселение"]
["Бурзянский муниципальный район","Байгазинский сельский совет","80619409","сельское поселение"]
["Бурзянский муниципальный район","Байназаровский сельский совет","80619410","сельское поселение"]
["Бурзянский муниципальный район","Бурзянский муниципальный район","80619000","муниципальный район"]
["Бурзянский муниципальный район","Галиакберовский сельский совет","80619413","сельское поселение"]
["Бурзянский муниципальный район","Иргизлинский сельский совет","80619416","сельское поселение"]
["Бурзянский муниципальный район","Киекбаевский сельский совет","80619419","сельское поселение"]
["Бурзянский муниципальный район","Кипчакский сельский совет","80619420","сельское поселение"]
["Бурзянский муниципальный район","Кулганинский сельский совет","80619440","сельское поселение"]
["Бурзянский муниципальный район","Старомунасиповский сельский совет","80619422","сельское поселение"]
["Бурзянский муниципальный район","Старосубхангуловский сельский совет","80619425","сельское поселение"]
["Бурзянский муниципальный район","Тимировский сельский совет","80619430","сельское поселение"]
["Гафурийский муниципальный район","Белоозерский сельский совет","80621407","сельское поселение"]
["Гафурийский муниципальный район","Бельский сельский совет","80621410","сельское поселение"]
["Гафурийский муниципальный район","Бурлинский сельский совет","80621413","сельское поселение"]
["Гафурийский муниципальный район","Буруновский сельский совет","80621414","сельское поселение"]
["Гафурийский муниципальный район","Гафурийский муниципальный район","80621000","муниципальный район"]
["Гафурийский муниципальный район","Зилим-Карановский сельский совет","80621416","сельское поселение"]
["Гафурийский муниципальный район","Имендяшевский сельский совет","80621419","сельское поселение"]
["Гафурийский муниципальный район","Ковардинский сельский совет","80621422","сельское поселение"]
["Гафурийский муниципальный район","Красноусольский сельский совет","80621423","сельское поселение"]
["Гафурийский муниципальный район","Мраковский сельский совет","80621425","сельское поселение"]
["Гафурийский муниципальный район","Саитбабинский сельский совет","80621428","сельское поселение"]
["Гафурийский муниципальный район","Табынский сельский совет","80621431","сельское поселение"]
["Гафурийский муниципальный район","Ташбукановский сельский совет","80621434","сельское поселение"]
["Гафурийский муниципальный район","Ташлинский сельский совет","80621437","сельское поселение"]
["Гафурийский муниципальный район","Толпаровский сельский совет","80621440","сельское поселение"]
["Гафурийский муниципальный район","Утяковский сельский совет","80621443","сельское поселение"]
["Гафурийский муниципальный район","Янгискаинский сельский совет","80621446","сельское поселение"]
["Город Агидель","Город Агидель","80703000","городской округ"]
["Город Кумертау","Город Кумертау","80723000","городской округ"]
["Город Нефтекамск","Город Нефтекамск","80727000","городской округ"]
["Город Октябрьский","Город Октябрьский","80735000","городской округ"]
["Город Салават","Город Салават","80739000","городской округ"]
["Город Сибай","Город Сибай","80743000","городской округ"]
["Город Стерлитамак","Город Стерлитамак","80745000","городской округ"]
["Город Уфа","Город Уфа","80701000","городской округ"]
["Давлекановский муниципальный район","Алгинский сельский совет","80622404","сельское поселение"]
["Давлекановский муниципальный район","Бик-Кармалинский сельский совет","80622410","сельское поселение"]
["Давлекановский муниципальный район","Город Давлеканово","80622101","городское поселение, в состав которого входит город"]
["Давлекановский муниципальный район","Давлекановский муниципальный район","80622000","муниципальный район"]
["Давлекановский муниципальный район","Ивановский сельский совет","80622413","сельское поселение"]
["Давлекановский муниципальный район","Имай-Кармалинский сельский совет","80622416","сельское поселение"]
["Давлекановский муниципальный район","Кадыргуловский сельский совет","80622419","сельское поселение"]
["Давлекановский муниципальный район","Казангуловский сельский совет","80622422","сельское поселение"]
["Давлекановский муниципальный район","Кидрячевский сельский совет","80622425","сельское поселение"]
["Давлекановский муниципальный район","Курманкеевский сельский совет","80622428","сельское поселение"]
["Давлекановский муниципальный район","Микяшевский сельский совет","80622431","сельское поселение"]
["Давлекановский муниципальный район","Поляковский сельский совет","80622434","сельское поселение"]
["Давлекановский муниципальный район","Раевский сельский совет","80622437","сельское поселение"]
["Давлекановский муниципальный район","Рассветовский сельский совет","80622440","сельское поселение"]
["Давлекановский муниципальный район","Сергиопольский сельский совет","80622443","сельское поселение"]
["Давлекановский муниципальный район","Соколовский сельский совет","80622444","сельское поселение"]
["Давлекановский муниципальный район","Чуюнчинский сельский совет","80622446","сельское поселение"]
["Давлекановский муниципальный район","Шестаевский сельский совет","80622449","сельское поселение"]
["Дуванский муниципальный район","Ариевский сельский совет","80623404","сельское поселение"]
["Дуванский муниципальный район","Вознесенский сельский совет","80623406","сельское поселение"]
["Дуванский муниципальный район","Дуванский муниципальный район","80623000","муниципальный район"]
["Дуванский муниципальный район","Дуванский сельский совет","80623407","сельское поселение"]
["Дуванский муниципальный район","Заимкинский сельский совет","80623413","сельское поселение"]
["Дуванский муниципальный район","Лемазинский сельский совет","80623419","сельское поселение"]
["Дуванский муниципальный район","Месягутовский сельский совет","80623422","сельское поселение"]
["Дуванский муниципальный район","Метелинский сельский совет","80623425","сельское поселение"]
["Дуванский муниципальный район","Михайловский сельский совет","80623428","сельское поселение"]
["Дуванский муниципальный район","Рухтинский сельский совет","80623431","сельское поселение"]
["Дуванский муниципальный район","Сальевский сельский совет","80623433","сельское поселение"]
["Дуванский муниципальный район","Сикиязский сельский совет","80623434","сельское поселение"]
["Дуванский муниципальный район","Улькундинский сельский совет","80623440","сельское поселение"]
["Дуванский муниципальный район","Ярославский сельский совет","80623443","сельское поселение"]
["Дюртюлинский муниципальный район","Ангасякский сельский совет","80624404","сельское поселение"]
["Дюртюлинский муниципальный район","Асяновский сельский совет","80624407","сельское поселение"]
["Дюртюлинский муниципальный район","Город Дюртюли","80624101","городское поселение, в состав которого входит город"]
["Дюртюлинский муниципальный район","Дюртюлинский муниципальный район","80624000","муниципальный район"]
["Дюртюлинский муниципальный район","Исмаиловский сельский совет","80624410","сельское поселение"]
["Дюртюлинский муниципальный район","Куккуяновский сельский совет","80624413","сельское поселение"]
["Дюртюлинский муниципальный район","Маядыковский сельский совет","80624416","сельское поселение"]
["Дюртюлинский муниципальный район","Московский сельский совет","80624422","сельское поселение"]
["Дюртюлинский муниципальный район","Семилетовский сельский совет","80624430","сельское поселение"]
["Дюртюлинский муниципальный район","Старобаишевский сельский совет","80624431","сельское поселение"]
["Дюртюлинский муниципальный район","Староянтузовский сельский совет","80624434","сельское поселение"]
["Дюртюлинский муниципальный район","Суккуловский сельский совет","80624437","сельское поселение"]
["Дюртюлинский муниципальный район","Таймурзинский сельский совет","80624440","сельское поселение"]
["Дюртюлинский муниципальный район","Такарликовский сельский совет","80624443","сельское поселение"]
["Дюртюлинский муниципальный район","Учпилинский сельский совет","80624447","сельское поселение"]
["Дюртюлинский муниципальный район","Черлаковский сельский совет","80624449","сельское поселение"]
["Ермекеевский муниципальный район","Бекетовский сельский совет","80625402","сельское поселение"]
["Ермекеевский муниципальный район","Восьмомартовский сельский совет","80625404","сельское поселение"]
["Ермекеевский муниципальный район","Ермекеевский муниципальный район","80625000","муниципальный район"]
["Ермекеевский муниципальный район","Ермекеевский сельский совет","80625407","сельское поселение"]
["Ермекеевский муниципальный район","Кызыл-Ярский сельский совет","80625411","сельское поселение"]
["Ермекеевский муниципальный район","Нижнеулу-Елгинский сельский совет","80625413","сельское поселение"]
["Ермекеевский муниципальный район","Рятамакский сельский совет","80625416","сельское поселение"]
["Ермекеевский муниципальный район","Спартакский сельский совет","80625422","сельское поселение"]
["Ермекеевский муниципальный район","Среднекарамалинский сельский совет","80625425","сельское поселение"]
["Ермекеевский муниципальный район","Старосуллинский сельский совет","80625428","сельское поселение"]
["Ермекеевский муниципальный район","Старотураевский сельский совет","80625431","сельское поселение"]
["Ермекеевский муниципальный район","Суккуловский сельский совет","80625434","сельское поселение"]
["Ермекеевский муниципальный район","Тарказинский сельский совет","80625437","сельское поселение"]
["Ермекеевский муниципальный район","Усман-Ташлинский сельский совет","80625440","сельское поселение"]
["ЗАТО город Межгорье","ЗАТО город Межгорье","80707000","городской округ"]
["Зианчуринский муниципальный район","Абзановский сельский совет","80626404","сельское поселение"]
["Зианчуринский муниципальный район","Абуляисовский сельский совет","80626405","сельское поселение"]
["Зианчуринский муниципальный район","Баишевский сельский совет","80626406","сельское поселение"]
["Зианчуринский муниципальный район","Байдавлетовский сельский совет","80626407","сельское поселение"]
["Зианчуринский муниципальный район","Бикбауский сельский совет","80626410","сельское поселение"]
["Зианчуринский муниципальный район","Зианчуринский муниципальный район","80626000","муниципальный район"]
["Зианчуринский муниципальный район","Исянгуловский сельский совет","80626416","сельское поселение"]
["Зианчуринский муниципальный район","Казанбулакский сельский совет","80626419","сельское поселение"]
["Зианчуринский муниципальный район","Муйнакский сельский совет","80626422","сельское поселение"]
["Зианчуринский муниципальный район","Новопетровский сельский совет","80626425","сельское поселение"]
["Зианчуринский муниципальный район","Новочебенкинский сельский совет","80626428","сельское поселение"]
["Зианчуринский муниципальный район","Сакмарский сельский совет","80626431","сельское поселение"]
["Зианчуринский муниципальный район","Суренский сельский совет","80626434","сельское поселение"]
["Зианчуринский муниципальный район","Тазларовский сельский совет","80626437","сельское поселение"]
["Зианчуринский муниципальный район","Утягуловский сельский совет","80626440","сельское поселение"]
["Зианчуринский муниципальный район","Яныбаевский сельский совет","80626443","сельское поселение"]
["Зилаирский муниципальный район","Бердяшский сельский совет","80627404","сельское поселение"]
["Зилаирский муниципальный район","Верхнегалеевский сельский совет","80627410","сельское поселение"]
["Зилаирский муниципальный район","Дмитриевский сельский совет","80627413","сельское поселение"]
["Зилаирский муниципальный район","Зилаирский муниципальный район","80627000","муниципальный район"]
["Зилаирский муниципальный район","Зилаирский сельский совет","80627416","сельское поселение"]
["Зилаирский муниципальный район","Ивано-Кувалатский сельский совет","80627419","сельское поселение"]
["Зилаирский муниципальный район","Кананикольский сельский совет","80627421","сельское поселение"]
["Зилаирский муниципальный район","Канзафаровский сельский совет","80627422","сельское поселение"]
["Зилаирский муниципальный район","Кашкаровский сельский совет","80627423","сельское поселение"]
["Зилаирский муниципальный район","Матраевский сельский совет","80627425","сельское поселение"]
["Зилаирский муниципальный район","Сабыровский сельский совет","80627432","сельское поселение"]
["Зилаирский муниципальный район","Уркасский сельский совет","80627434","сельское поселение"]
["Зилаирский муниципальный район","Юлдыбаевский сельский совет","80627436","сельское поселение"]
["Зилаирский муниципальный район","Ямансазский сельский совет","80627442","сельское поселение"]
["Иглинский муниципальный район","Акбердинский сельский совет","80628403","сельское поселение"]
["Иглинский муниципальный район","Ауструмский сельский совет","80628405","сельское поселение"]
["Иглинский муниципальный район","Балтийский сельский совет","80628410","сельское поселение"]
["Иглинский муниципальный район","Ивано-Казанский сельский совет","80628415","сельское поселение"]
["Иглинский муниципальный район","Иглинский муниципальный район","80628000","муниципальный район"]
["Иглинский муниципальный район","Иглинский сельский совет","80628416","сельское поселение"]
["Иглинский муниципальный район","Калтымановский сельский совет","80628420","сельское поселение"]
["Иглинский муниципальный район","Кальтовский сельский совет","80628425","сельское поселение"]
["Иглинский муниципальный район","Красновосходский сельский совет","80628430","сельское поселение"]
["Иглинский муниципальный район","Кудеевский сельский совет","80628432","сельское поселение"]
["Иглинский муниципальный район","Лемезинский сельский совет","80628435","сельское поселение"]
["Иглинский муниципальный район","Майский сельский совет","80628440","сельское поселение"]
["Иглинский муниципальный район","Надеждинский сельский совет","80628445","сельское поселение"]
["Иглинский муниципальный район","Охлебининский сельский совет","80628450","сельское поселение"]
["Иглинский муниципальный район","Тавтимановский сельский совет","80628455","сельское поселение"]
["Иглинский муниципальный район","Турбаслинский сельский совет","80628460","сельское поселение"]
["Иглинский муниципальный район","Уктеевский сельский совет","80628470","сельское поселение"]
["Иглинский муниципальный район","Улу-Телякский сельский совет","80628472","сельское поселение"]
["Иглинский муниципальный район","Урманский сельский совет","80628474","сельское поселение"]
["Иглинский муниципальный район","Чуваш-Кубовский сельский совет","80628480","сельское поселение"]
["Илишевский муниципальный район","Аккузевский сельский совет","80630404","сельское поселение"]
["Илишевский муниципальный район","Андреевский сельский совет","80630408","сельское поселение"]
["Илишевский муниципальный район","Базитамакский сельский совет","80630412","сельское поселение"]
["Илишевский муниципальный район","Бишкураевский сельский совет","80630416","сельское поселение"]
["Илишевский муниципальный район","Дюмеевский сельский совет","80630424","сельское поселение"]
["Илишевский муниципальный район","Игметовский сельский совет","80630426","сельское поселение"]
["Илишевский муниципальный район","Илишевский муниципальный район","80630000","муниципальный район"]
["Илишевский муниципальный район","Исаметовский сельский совет","80630428","сельское поселение"]
["Илишевский муниципальный район","Исанбаевский сельский совет","80630432","сельское поселение"]
["Илишевский муниципальный район","Итеевский сельский совет","80630436","сельское поселение"]
["Илишевский муниципальный район","Ишкаровский сельский совет","80630440","сельское поселение"]
["Илишевский муниципальный район","Кадыровский сельский совет","80630444","сельское поселение"]
["Илишевский муниципальный район","Карабашевский сельский совет","80630448","сельское поселение"]
["Илишевский муниципальный район","Кужбахтинский сельский совет","80630452","сельское поселение"]
["Илишевский муниципальный район","Новомедведевский сельский совет","80630456","сельское поселение"]
["Илишевский муниципальный район","Рсаевский сельский совет","80630460","сельское поселение"]
["Илишевский муниципальный район","Старокуктовский сельский совет","80630464","сельское поселение"]
["Илишевский муниципальный район","Сюльтинский сельский совет","80630468","сельское поселение"]
["Илишевский муниципальный район","Урметовский сельский совет","80630472","сельское поселение"]
["Илишевский муниципальный район","Черекулевский сельский совет","80630476","сельское поселение"]
["Илишевский муниципальный район","Юнновский сельский совет","80630478","сельское поселение"]
["Илишевский муниципальный район","Ябалаковский сельский совет","80630480","сельское поселение"]
["Илишевский муниципальный район","Яркеевский сельский совет","80630484","сельское поселение"]
["Ишимбайский муниципальный район","Арметовский сельский совет","80631405","сельское поселение"]
["Ишимбайский муниципальный район","Байгузинский сельский совет","80631415","сельское поселение"]
["Ишимбайский муниципальный район","Верхоторский сельский совет","80631425","сельское поселение"]
["Ишимбайский муниципальный район","Город Ишимбай","80631101","городское поселение, в состав которого входит город"]
["Ишимбайский муниципальный район","Иткуловский сельский совет","80631430","сельское поселение"]
["Ишимбайский муниципальный район","Ишеевский сельский совет","80631435","сельское поселение"]
["Ишимбайский муниципальный район","Ишимбайский муниципальный район","80631000","муниципальный район"]
["Ишимбайский муниципальный район","Кузяновский сельский совет","80631440","сельское поселение"]
["Ишимбайский муниципальный район","Кулгунинский сельский совет","80631445","сельское поселение"]
["Ишимбайский муниципальный район","Макаровский сельский совет","80631450","сельское поселение"]
["Ишимбайский муниципальный район","Петровский сельский совет","80631455","сельское поселение"]
["Ишимбайский муниципальный район","Сайрановский сельский совет","80631460","сельское поселение"]
["Ишимбайский муниципальный район","Скворчихинский сельский совет","80631470","сельское поселение"]
["Ишимбайский муниципальный район","Урман-Бишкадакский сельский совет","80631475","сельское поселение"]
["Ишимбайский муниципальный район","Янурусовский сельский совет","80631480","сельское поселение"]
["Калтасинский муниципальный район","Амзибашевский сельский совет","80633403","сельское поселение"]
["Калтасинский муниципальный район","Большекачаковский сельский совет","80633405","сельское поселение"]
["Калтасинский муниципальный район","Калегинский сельский совет","80633415","сельское поселение"]
["Калтасинский муниципальный район","Калмиябашевский сельский совет","80633420","сельское поселение"]
["Калтасинский муниципальный район","Калтасинский муниципальный район","80633000","муниципальный район"]
["Калтасинский муниципальный район","Калтасинский сельский совет","80633425","сельское поселение"]
["Калтасинский муниципальный район","Кельтеевский сельский совет","80633430","сельское поселение"]
["Калтасинский муниципальный район","Краснохолмский сельский совет","80633447","сельское поселение"]
["Калтасинский муниципальный район","Нижнекачмашевский сельский совет","80633445","сельское поселение"]
["Калтасинский муниципальный район","Новокильбахтинский сельский совет","80633446","сельское поселение"]
["Калтасинский муниципальный район","Старояшевский сельский совет","80633452","сельское поселение"]
["Калтасинский муниципальный район","Тюльдинский сельский совет","80633450","сельское поселение"]
["Караидельский муниципальный район","Артакульский сельский совет","80634404","сельское поселение"]
["Караидельский муниципальный район","Байкибашевский сельский совет","80634412","сельское поселение"]
["Караидельский муниципальный район","Байкинский сельский совет","80634416","сельское поселение"]
["Караидельский муниципальный район","Верхнесуянский сельский совет","80634424","сельское поселение"]
["Караидельский муниципальный район","Караидельский муниципальный район","80634000","муниципальный район"]
["Караидельский муниципальный район","Караидельский сельский совет","80634432","сельское поселение"]
["Караидельский муниципальный район","Караярский сельский совет","80634436","сельское поселение"]
["Караидельский муниципальный район","Кирзинский сельский совет","80634440","сельское поселение"]
["Караидельский муниципальный район","Куртлыкульский сельский совет","80634444","сельское поселение"]
["Караидельский муниципальный район","Магинский сельский совет","80634445","сельское поселение"]
["Караидельский муниципальный район","Новобердяшский сельский совет","80634452","сельское поселение"]
["Караидельский муниципальный район","Новомуллакаевский сельский совет","80634456","сельское поселение"]
["Караидельский муниципальный район","Озеркинский сельский совет","80634460","сельское поселение"]
["Караидельский муниципальный район","Подлубовский сельский совет","80634464","сельское поселение"]
["Караидельский муниципальный район","Староакбуляковский сельский совет","80634472","сельское поселение"]
["Караидельский муниципальный район","Ургушевский сельский совет","80634480","сельское поселение"]
["Караидельский муниципальный район","Урюш-Битуллинский сельский совет","80634484","сельское поселение"]
["Караидельский муниципальный район","Явгильдинский сельский совет","80634488","сельское поселение"]
["Кармаскалинский муниципальный район","Адзитаровский сельский совет","80635405","сельское поселение"]
["Кармаскалинский муниципальный район","Бузовьязовский сельский совет","80635415","сельское поселение"]
["Кармаскалинский муниципальный район","Ефремкинский сельский совет","80635420","сельское поселение"]
["Кармаскалинский муниципальный район","Кабаковский сельский совет","80635423","сельское поселение"]
["Кармаскалинский муниципальный район","Камышлинский сельский совет","80635425","сельское поселение"]
["Кармаскалинский муниципальный район","Карламанский сельский совет","80635430","сельское поселение"]
["Кармаскалинский муниципальный район","Кармаскалинский муниципальный район","80635000","муниципальный район"]
["Кармаскалинский муниципальный район","Кармаскалинский сельский совет","80635435","сельское поселение"]
["Кармаскалинский муниципальный район","Николаевский сельский совет","80635440","сельское поселение"]
["Кармаскалинский муниципальный район","Новокиешкинский сельский совет","80635445","сельское поселение"]
["Кармаскалинский муниципальный район","Подлубовский сельский совет","80635450","сельское поселение"]
["Кармаскалинский муниципальный район","Прибельский сельский совет","80635451","сельское поселение"]
["Кармаскалинский муниципальный район","Савалеевский сельский совет","80635455","сельское поселение"]
["Кармаскалинский муниципальный район","Сахаевский сельский совет","80635475","сельское поселение"]
["Кармаскалинский муниципальный район","Старобабичевский сельский совет","80635465","сельское поселение"]
["Кармаскалинский муниципальный район","Старомусинский сельский совет","80635470","сельское поселение"]
["Кармаскалинский муниципальный район","Шаймуратовский сельский совет","80635480","сельское поселение"]
["Кигинский муниципальный район","Абзаевский сельский совет","80636405","сельское поселение"]
["Кигинский муниципальный район","Арслановский сельский совет","80636410","сельское поселение"]
["Кигинский муниципальный район","Верхнекигинский сельский совет","80636415","сельское поселение"]
["Кигинский муниципальный район","Душанбековский сельский совет","80636425","сельское поселение"]
["Кигинский муниципальный район","Еланлинский сельский совет","80636420","сельское поселение"]
["Кигинский муниципальный район","Ибраевский сельский совет","80636430","сельское поселение"]
["Кигинский муниципальный район","Кандаковский сельский совет","80636435","сельское поселение"]
["Кигинский муниципальный район","Кигинский муниципальный район","80636000","муниципальный район"]
["Кигинский муниципальный район","Леузинский сельский совет","80636440","сельское поселение"]
["Кигинский муниципальный район","Нижнекигинский сельский совет","80636445","сельское поселение"]
["Краснокамский муниципальный район","Арлановский сельский совет","80637405","сельское поселение"]
["Краснокамский муниципальный район","Кариевский сельский совет","80637410","сельское поселение"]
["Краснокамский муниципальный район","Краснокамский муниципальный район","80637000","муниципальный район"]
["Краснокамский муниципальный район","Куяновский сельский совет","80637412","сельское поселение"]
["Краснокамский муниципальный район","Музяковский сельский совет","80637415","сельское поселение"]
["Краснокамский муниципальный район","Николо-Березовский сельский совет","80637421","сельское поселение"]
["Краснокамский муниципальный район","Никольский сельский совет","80637420","сельское поселение"]
["Краснокамский муниципальный район","Новобуринский сельский совет","80637425","сельское поселение"]
["Краснокамский муниципальный район","Новокабановский сельский совет","80637430","сельское поселение"]
["Краснокамский муниципальный район","Новокаинлыковский сельский совет","80637435","сельское поселение"]
["Краснокамский муниципальный район","Новонагаевский сельский совет","80637440","сельское поселение"]
["Краснокамский муниципальный район","Новоянзигитовский сельский совет","80637461","сельское поселение"]
["Краснокамский муниципальный район","Раздольевский сельский совет","80637443","сельское поселение"]
["Краснокамский муниципальный район","Саузбашевский сельский совет","80637450","сельское поселение"]
["Краснокамский муниципальный район","Шушнурский сельский совет","80637465","сельское поселение"]
["Кугарчинский муниципальный район","Волостновский сельский совет","80638405","сельское поселение"]
["Кугарчинский муниципальный район","Зареченский сельский совет","80638410","сельское поселение"]
["Кугарчинский муниципальный район","Ибраевский сельский совет","80638415","сельское поселение"]
["Кугарчинский муниципальный район","Ижбердинский сельский совет","80638420","сельское поселение"]
["Кугарчинский муниципальный район","Иртюбякский сельский совет","80638425","сельское поселение"]
["Кугарчинский муниципальный район","Исимовский сельский совет","80638430","сельское поселение"]
["Кугарчинский муниципальный район","Кугарчинский муниципальный район","80638000","муниципальный район"]
["Кугарчинский муниципальный район","Кугарчинский сельский совет","80638440","сельское поселение"]
["Кугарчинский муниципальный район","Максютовский сельский совет","80638445","сельское поселение"]
["Кугарчинский муниципальный район","Мраковский сельский совет","80638450","сельское поселение"]
["Кугарчинский муниципальный район","Нижнебиккузинский сельский совет","80638455","сельское поселение"]
["Кугарчинский муниципальный район","Новопетровский сельский совет","80638460","сельское поселение"]
["Кугарчинский муниципальный район","Нукаевский сельский совет","80638463","сельское поселение"]
["Кугарчинский муниципальный район","Побоищенский сельский совет","80638470","сельское поселение"]
["Кугарчинский муниципальный район","Санзяповский сельский совет","80638473","сельское поселение"]
["Кугарчинский муниципальный район","Тляумбетовский сельский совет","80638475","сельское поселение"]
["Кугарчинский муниципальный район","Уральский сельский совет","80638480","сельское поселение"]
["Кугарчинский муниципальный район","Чапаевский сельский совет","80638483","сельское поселение"]
["Кугарчинский муниципальный район","Юлдыбаевский сельский совет","80638485","сельское поселение"]
["Кугарчинский муниципальный район","Юмагузинский сельский совет","80638487","сельское поселение"]
["Кугарчинский муниципальный район","Ялчинский сельский совет","80638495","сельское поселение"]
["Кушнаренковский муниципальный район","Ахметовский сельский совет","80640405","сельское поселение"]
["Кушнаренковский муниципальный район","Бакаевский сельский совет","80640410","сельское поселение"]
["Кушнаренковский муниципальный район","Горьковский сельский совет","80640415","сельское поселение"]
["Кушнаренковский муниципальный район","Карача-Елгинский сельский совет","80640430","сельское поселение"]
["Кушнаренковский муниципальный район","Кушнаренковский муниципальный район","80640000","муниципальный район"]
["Кушнаренковский муниципальный район","Кушнаренковский сельский совет","80640435","сельское поселение"]
["Кушнаренковский муниципальный район","Матвеевский сельский совет","80640440","сельское поселение"]
["Кушнаренковский муниципальный район","Расмекеевский сельский совет","80640465","сельское поселение"]
["Кушнаренковский муниципальный район","Старогумеровский сельский совет","80640470","сельское поселение"]
["Кушнаренковский муниципальный район","Старокамышлинский сельский совет","80640475","сельское поселение"]
["Кушнаренковский муниципальный район","Старокурмашевский сельский совет","80640477","сельское поселение"]
["Кушнаренковский муниципальный район","Старотукмаклинский сельский совет","80640480","сельское поселение"]
["Кушнаренковский муниципальный район","Шариповский сельский совет","80640490","сельское поселение"]
["Куюргазинский муниципальный район","Бахмутский сельский совет","80639410","сельское поселение"]
["Куюргазинский муниципальный район","Ермолаевский сельский совет","80639412","сельское поселение"]
["Куюргазинский муниципальный район","Зяк-Ишметовский сельский совет","80639417","сельское поселение"]
["Куюргазинский муниципальный район","Илькинеевский сельский совет","80639415","сельское поселение"]
["Куюргазинский муниципальный район","Кривле-Илюшкинский сельский совет","80639420","сельское поселение"]
["Куюргазинский муниципальный район","Куюргазинский муниципальный район","80639000","муниципальный район"]
["Куюргазинский муниципальный район","Ленинский сельский совет","80639425","сельское поселение"]
["Куюргазинский муниципальный район","Мурапталовский сельский совет","80639435","сельское поселение"]
["Куюргазинский муниципальный район","Отрадинский сельский совет","80639440","сельское поселение"]
["Куюргазинский муниципальный район","Свободинский сельский совет","80639450","сельское поселение"]
["Куюргазинский муниципальный район","Таймасовский сельский совет","80639455","сельское поселение"]
["Куюргазинский муниципальный район","Шабагишский сельский совет","80639460","сельское поселение"]
["Куюргазинский муниципальный район","Якшимбетовский сельский совет","80639465","сельское поселение"]
["Мелеузовский муниципальный район","Абитовский сельский совет","80641402","сельское поселение"]
["Мелеузовский муниципальный район","Александровский сельский совет","80641405","сельское поселение"]
["Мелеузовский муниципальный район","Аптраковский сельский совет","80641410","сельское поселение"]
["Мелеузовский муниципальный район","Араслановский сельский совет","80641415","сельское поселение"]
["Мелеузовский муниципальный район","Воскресенский сельский совет","80641422","сельское поселение"]
["Мелеузовский муниципальный район","Город Мелеуз","80641101","городское поселение, в состав которого входит город"]
["Мелеузовский муниципальный район","Денисовский сельский совет","80641435","сельское поселение"]
["Мелеузовский муниципальный район","Зирганский сельский совет","80641430","сельское поселение"]
["Мелеузовский муниципальный район","Иштугановский сельский совет","80641445","сельское поселение"]
["Мелеузовский муниципальный район","Корнеевский сельский совет","80641480","сельское поселение"]
["Мелеузовский муниципальный район","Мелеузовский муниципальный район","80641000","муниципальный район"]
["Мелеузовский муниципальный район","Мелеузовский сельский совет","80641450","сельское поселение"]
["Мелеузовский муниципальный район","Нордовский сельский совет","80641455","сельское поселение"]
["Мелеузовский муниципальный район","Нугушевский сельский совет","80641460","сельское поселение"]
["Мелеузовский муниципальный район","Партизанский сельский совет","80641465","сельское поселение"]
["Мелеузовский муниципальный район","Первомайский сельский совет","80641470","сельское поселение"]
["Мелеузовский муниципальный район","Сарышевский сельский совет","80641475","сельское поселение"]
["Мелеузовский муниципальный район","Шевченковский сельский совет","80641485","сельское поселение"]
["Мечетлинский муниципальный район","Абдуллинский сельский совет","80642401","сельское поселение"]
["Мечетлинский муниципальный район","Алегазовский сельский совет","80642405","сельское поселение"]
["Мечетлинский муниципальный район","Большеокинский сельский совет","80642410","сельское поселение"]
["Мечетлинский муниципальный район","Большеустьикинский сельский совет","80642415","сельское поселение"]
["Мечетлинский муниципальный район","Дуван-Мечетлинский сельский совет","80642420","сельское поселение"]
["Мечетлинский муниципальный район","Кургатовский сельский совет","80642423","сельское поселение"]
["Мечетлинский муниципальный район","Лемез-Тамакский сельский совет","80642425","сельское поселение"]
["Мечетлинский муниципальный район","Малоустьикинский сельский совет","80642430","сельское поселение"]
["Мечетлинский муниципальный район","Мечетлинский муниципальный район","80642000","муниципальный район"]
["Мечетлинский муниципальный район","Новомещеровский сельский совет","80642435","сельское поселение"]
["Мечетлинский муниципальный район","Новояушевский сельский совет","80642442","сельское поселение"]
["Мечетлинский муниципальный район","Ростовский сельский совет","80642445","сельское поселение"]
["Мечетлинский муниципальный район","Юнусовский сельский совет","80642450","сельское поселение"]
["Мишкинский муниципальный район","Акбулатовский сельский совет","80643405","сельское поселение"]
["Мишкинский муниципальный район","Баймурзинский сельский совет","80643410","сельское поселение"]
["Мишкинский муниципальный район","Большесухоязовский сельский совет","80643415","сельское поселение"]
["Мишкинский муниципальный район","Большешадинский сельский совет","80643420","сельское поселение"]
["Мишкинский муниципальный район","Ирсаевский сельский совет","80643425","сельское поселение"]
["Мишкинский муниципальный район","Кайраковский сельский совет","80643430","сельское поселение"]
["Мишкинский муниципальный район","Камеевский сельский совет","80643435","сельское поселение"]
["Мишкинский муниципальный район","Мавлютовский сельский совет","80643445","сельское поселение"]
["Мишкинский муниципальный район","Мишкинский муниципальный район","80643000","муниципальный район"]
["Мишкинский муниципальный район","Мишкинский сельский совет","80643450","сельское поселение"]
["Мишкинский муниципальный район","Новотроицкий сельский совет","80643455","сельское поселение"]
["Мишкинский муниципальный район","Староарзаматовский сельский совет","80643460","сельское поселение"]
["Мишкинский муниципальный район","Тынбаевский сельский совет","80643465","сельское поселение"]
["Мишкинский муниципальный район","Урьядинский сельский совет","80643470","сельское поселение"]
["Мишкинский муниципальный район","Чураевский сельский совет","80643480","сельское поселение"]
["Миякинский муниципальный район","Биккуловский сельский совет","80644405","сельское поселение"]
["Миякинский муниципальный район","Богдановский сельский совет","80644410","сельское поселение"]
["Миякинский муниципальный район","Большекаркалинский сельский совет","80644415","сельское поселение"]
["Миякинский муниципальный район","Енебей-Урсаевский сельский совет","80644420","сельское поселение"]
["Миякинский муниципальный район","Зильдяровский сельский совет","80644425","сельское поселение"]
["Миякинский муниципальный район","Ильчигуловский сельский совет","80644428","сельское поселение"]
["Миякинский муниципальный район","Карановский сельский совет","80644429","сельское поселение"]
["Миякинский муниципальный район","Качегановский сельский совет","80644430","сельское поселение"]
["Миякинский муниципальный район","Кожай-Семеновский сельский совет","80644435","сельское поселение"]
["Миякинский муниципальный район","Менеузтамакский сельский совет","80644440","сельское поселение"]
["Миякинский муниципальный район","Миякибашевский сельский совет","80644445","сельское поселение"]
["Миякинский муниципальный район","Миякинский муниципальный район","80644000","муниципальный район"]
["Миякинский муниципальный район","Миякинский сельский совет","80644450","сельское поселение"]
["Миякинский муниципальный район","Новокарамалинский сельский совет","80644460","сельское поселение"]
["Миякинский муниципальный район","Сатыевский сельский совет","80644465","сельское поселение"]
["Миякинский муниципальный район","Уршакбашкарамалинский сельский совет","80644470","сельское поселение"]
["Нуримановский муниципальный район","Байгильдинский сельский совет","80645405","сельское поселение"]
["Нуримановский муниципальный район","Баш-Шидинский сельский совет","80645410","сельское поселение"]
["Нуримановский муниципальный район","Красногорский сельский совет","80645415","сельское поселение"]
["Нуримановский муниципальный район","Красноключевский сельский совет","80645416","сельское поселение"]
["Нуримановский муниципальный район","Никольский сельский совет","80645420","сельское поселение"]
["Нуримановский муниципальный район","Новокулевский сельский совет","80645435","сельское поселение"]
["Нуримановский муниципальный район","Новосубаевский сельский совет","80645440","сельское поселение"]
["Нуримановский муниципальный район","Нуримановский муниципальный район","80645000","муниципальный район"]
["Нуримановский муниципальный район","Павловский сельский совет","80645444","сельское поселение"]
["Нуримановский муниципальный район","Первомайский сельский совет","80645445","сельское поселение"]
["Нуримановский муниципальный район","Сарвинский сельский совет","80645450","сельское поселение"]
["Нуримановский муниципальный район","Старобедеевский сельский совет","80645452","сельское поселение"]
["Нуримановский муниципальный район","Староисаевский сельский совет","80645455","сельское поселение"]
["Салаватский муниципальный район","Алькинский сельский совет","80647405","сельское поселение"]
["Салаватский муниципальный район","Аркауловский сельский совет","80647410","сельское поселение"]
["Салаватский муниципальный район","Ишимбаевский сельский совет","80647415","сельское поселение"]
["Салаватский муниципальный район","Лагеревский сельский совет","80647425","сельское поселение"]
["Салаватский муниципальный район","Лаклинский сельский совет","80647430","сельское поселение"]
["Салаватский муниципальный район","Малоязовский сельский совет","80647435","сельское поселение"]
["Салаватский муниципальный район","Мечетлинский сельский совет","80647440","сельское поселение"]
["Салаватский муниципальный район","Мещегаровский сельский совет","80647445","сельское поселение"]
["Салаватский муниципальный район","Мурсалимкинский сельский совет","80647447","сельское поселение"]
["Салаватский муниципальный район","Насибашевский сельский совет","80647450","сельское поселение"]
["Салаватский муниципальный район","Первомайский сельский совет","80647476","сельское поселение"]
["Салаватский муниципальный район","Салаватский муниципальный район","80647000","муниципальный район"]
["Салаватский муниципальный район","Салаватский сельский совет","80647453","сельское поселение"]
["Салаватский муниципальный район","Таймеевский сельский совет","80647455","сельское поселение"]
["Салаватский муниципальный район","Терменевский сельский совет","80647460","сельское поселение"]
["Салаватский муниципальный район","Турналинский сельский совет","80647465","сельское поселение"]
["Салаватский муниципальный район","Янгантауский сельский совет","80647475","сельское поселение"]
["Стерлибашевский муниципальный район","Айдаралинский сельский совет","80648405","сельское поселение"]
["Стерлибашевский муниципальный район","Аллагуватский сельский совет","80648402","сельское поселение"]
["Стерлибашевский муниципальный район","Бакеевский сельский совет","80648410","сельское поселение"]
["Стерлибашевский муниципальный район","Бузатовский сельский совет","80648415","сельское поселение"]
["Стерлибашевский муниципальный район","Кабакушский сельский совет","80648418","сельское поселение"]
["Стерлибашевский муниципальный район","Карагушский сельский совет","80648420","сельское поселение"]
["Стерлибашевский муниципальный район","Куганакбашевский сельский совет","80648425","сельское поселение"]
["Стерлибашевский муниципальный район","Кундрякский сельский совет","80648430","сельское поселение"]
["Стерлибашевский муниципальный район","Сарайсинский сельский совет","80648435","сельское поселение"]
["Стерлибашевский муниципальный район","Старокалкашевский сельский совет","80648440","сельское поселение"]
["Стерлибашевский муниципальный район","Стерлибашевский муниципальный район","80648000","муниципальный район"]
["Стерлибашевский муниципальный район","Стерлибашевский сельский совет","80648445","сельское поселение"]
["Стерлибашевский муниципальный район","Тятер-Араслановский сельский совет","80648455","сельское поселение"]
["Стерлибашевский муниципальный район","Халикеевский сельский совет","80648460","сельское поселение"]
["Стерлибашевский муниципальный район","Янгурчинский сельский совет","80648465","сельское поселение"]
["Стерлибашевский муниципальный район","Яшергановский сельский совет","80648470","сельское поселение"]
["Стерлитамакский муниципальный район","Айгулевский сельский совет","80649404","сельское поселение"]
["Стерлитамакский муниципальный район","Алатанинский сельский совет","80649412","сельское поселение"]
["Стерлитамакский муниципальный район","Ашкадарский сельский совет","80649416","сельское поселение"]
["Стерлитамакский муниципальный район","Аючевский сельский совет","80649418","сельское поселение"]
["Стерлитамакский муниципальный район","Буриказгановский сельский совет","80649428","сельское поселение"]
["Стерлитамакский муниципальный район","Казадаевский сельский совет","80649436","сельское поселение"]
["Стерлитамакский муниципальный район","Константиноградовский сельский совет","80649420","сельское поселение"]
["Стерлитамакский муниципальный район","Красноярский сельский совет","80649444","сельское поселение"]
["Стерлитамакский муниципальный район","Куганакский сельский совет","80649440","сельское поселение"]
["Стерлитамакский муниципальный район","Максимовский сельский совет","80649424","сельское поселение"]
["Стерлитамакский муниципальный район","Наумовский сельский совет","80649448","сельское поселение"]
["Стерлитамакский муниципальный район","Николаевский сельский совет","80649452","сельское поселение"]
["Стерлитамакский муниципальный район","Октябрьский сельский совет","80649460","сельское поселение"]
["Стерлитамакский муниципальный район","Отрадовский сельский совет","80649456","сельское поселение"]
["Стерлитамакский муниципальный район","Первомайский сельский совет","80649464","сельское поселение"]
["Стерлитамакский муниципальный район","Подлесненский сельский совет","80649468","сельское поселение"]
["Стерлитамакский муниципальный район","Рощинский сельский совет","80649478","сельское поселение"]
["Стерлитамакский муниципальный район","Рязановский сельский совет","80649480","сельское поселение"]
["Стерлитамакский муниципальный район","Стерлитамакский муниципальный район","80649000","муниципальный район"]
["Стерлитамакский муниципальный район","Тюрюшлинский сельский совет","80649488","сельское поселение"]
["Стерлитамакский муниципальный район","Услинский сельский совет","80649492","сельское поселение"]
["Татышлинский муниципальный район","Акбулатовский сельский совет","80650405","сельское поселение"]
["Татышлинский муниципальный район","Аксаитовский сельский совет","80650410","сельское поселение"]
["Татышлинский муниципальный район","Бадряшевский сельский совет","80650415","сельское поселение"]
["Татышлинский муниципальный район","Буль-Кайпановский сельский совет","80650420","сельское поселение"]
["Татышлинский муниципальный район","Верхнетатышлинский сельский совет","80650425","сельское поселение"]
["Татышлинский муниципальный район","Кальмияровский сельский совет","80650430","сельское поселение"]
["Татышлинский муниципальный район","Кальтяевский сельский совет","80650435","сельское поселение"]
["Татышлинский муниципальный район","Кудашевский сельский совет","80650440","сельское поселение"]
["Татышлинский муниципальный район","Курдымский сельский совет","80650445","сельское поселение"]
["Татышлинский муниципальный район","Нижнебалтачевский сельский совет","80650450","сельское поселение"]
["Татышлинский муниципальный район","Новотатышлинский сельский совет","80650455","сельское поселение"]
["Татышлинский муниципальный район","Татышлинский муниципальный район","80650000","муниципальный район"]
["Татышлинский муниципальный район","Шулгановский сельский совет","80650460","сельское поселение"]
["Татышлинский муниципальный район","Ялгыз-Наратский сельский совет","80650465","сельское поселение"]
["Туймазинский муниципальный район","Бишкураевский сельский совет","80651405","сельское поселение"]
["Туймазинский муниципальный район","Верхнебишиндинский сельский совет","80651410","сельское поселение"]
["Туймазинский муниципальный район","Верхнетроицкий сельский совет","80651415","сельское поселение"]
["Туймазинский муниципальный район","Гафуровский сельский совет","80651417","сельское поселение"]
["Туймазинский муниципальный район","Город Туймазы","80651101","городское поселение, в состав которого входит город"]
["Туймазинский муниципальный район","Ильчимбетовский сельский совет","80651420","сельское поселение"]
["Туймазинский муниципальный район","Какрыбашевский сельский совет","80651425","сельское поселение"]
["Туймазинский муниципальный район","Кандринский сельский совет","80651427","сельское поселение"]
["Туймазинский муниципальный район","Карамалы-Губеевский сельский совет","80651430","сельское поселение"]
["Туймазинский муниципальный район","Каратовский сельский совет","80651435","сельское поселение"]
["Туймазинский муниципальный район","Нижнетроицкий сельский совет","80651439","сельское поселение"]
["Туймазинский муниципальный район","Николаевский сельский совет","80651440","сельское поселение"]
["Туймазинский муниципальный район","Сайрановский сельский совет","80651445","сельское поселение"]
["Туймазинский муниципальный район","Серафимовский сельский совет","80651447","сельское поселение"]
["Туймазинский муниципальный район","Старотуймазинский сельский совет","80651455","сельское поселение"]
["Туймазинский муниципальный район","Субханкуловский сельский совет","80651461","сельское поселение"]
["Туймазинский муниципальный район","Татар-Улкановский сельский совет","80651465","сельское поселение"]
["Туймазинский муниципальный район","Туймазинский муниципальный район","80651000","муниципальный район"]
["Туймазинский муниципальный район","Тюменяковский сельский совет","80651470","сельское поселение"]
["Туймазинский муниципальный район","Чукадыбашевский сельский совет","80651475","сельское поселение"]
["Уфимский муниципальный район","Авдонский сельский совет","80652405","сельское поселение"]
["Уфимский муниципальный район","Алексеевский сельский совет","80652403","сельское поселение"]
["Уфимский муниципальный район","Булгаковский сельский совет","80652410","сельское поселение"]
["Уфимский муниципальный район","Дмитриевский сельский совет","80652415","сельское поселение"]
["Уфимский муниципальный район","Жуковский сельский совет","80652418","сельское поселение"]
["Уфимский муниципальный район","Зубовский сельский совет","80652420","сельское поселение"]
["Уфимский муниципальный район","Кармасанский сельский совет","80652423","сельское поселение"]
["Уфимский муниципальный район","Кирилловский сельский совет","80652425","сельское поселение"]
["Уфимский муниципальный район","Красноярский сельский совет","80652430","сельское поселение"]
["Уфимский муниципальный район","Миловский сельский совет","80652435","сельское поселение"]
["Уфимский муниципальный район","Михайловский сельский совет","80652440","сельское поселение"]
["Уфимский муниципальный район","Николаевский сельский совет","80652450","сельское поселение"]
["Уфимский муниципальный район","Ольховский сельский совет","80652452","сельское поселение"]
["Уфимский муниципальный район","Русско-Юрмашский сельский совет","80652455","сельское поселение"]
["Уфимский муниципальный район","Таптыковский сельский совет","80652460","сельское поселение"]
["Уфимский муниципальный район","Уфимский муниципальный район","80652000","муниципальный район"]
["Уфимский муниципальный район","Черкасский сельский совет","80652472","сельское поселение"]
["Уфимский муниципальный район","Чесноковский сельский совет","80652473","сельское поселение"]
["Уфимский муниципальный район","Шемякский сельский совет","80652475","сельское поселение"]
["Уфимский муниципальный район","Юматовский сельский совет","80652480","сельское поселение"]
["Учалинский муниципальный район","Амангильдинский сельский совет","80653410","сельское поселение"]
["Учалинский муниципальный район","Ахуновский сельский совет","80653415","сельское поселение"]
["Учалинский муниципальный район","Буйдинский сельский совет","80653416","сельское поселение"]
["Учалинский муниципальный район","Город Учалы","80653101","городское поселение, в состав которого входит город"]
["Учалинский муниципальный район","Ильчигуловский сельский совет","80653420","сельское поселение"]
["Учалинский муниципальный район","Ильчинский сельский совет","80653425","сельское поселение"]
["Учалинский муниципальный район","Имангуловский сельский совет","80653430","сельское поселение"]
["Учалинский муниципальный район","Кирябинский сельский совет","80653440","сельское поселение"]
["Учалинский муниципальный район","Кунакбаевский сельский совет","80653445","сельское поселение"]
["Учалинский муниципальный район","Мансуровский сельский совет","80653449","сельское поселение"]
["Учалинский муниципальный район","Миндякский сельский совет","80653448","сельское поселение"]
["Учалинский муниципальный район","Наурузовский сельский совет","80653450","сельское поселение"]
["Учалинский муниципальный район","Новобайрамгуловский сельский совет","80653455","сельское поселение"]
["Учалинский муниципальный район","Поляковский сельский совет","80653465","сельское поселение"]
["Учалинский муниципальный район","Сафаровский сельский совет","80653470","сельское поселение"]
["Учалинский муниципальный район","Тунгатаровский сельский совет","80653484","сельское поселение"]
["Учалинский муниципальный район","Уразовский сельский совет","80653488","сельское поселение"]
["Учалинский муниципальный район","Уральский сельский совет","80653491","сельское поселение"]
["Учалинский муниципальный район","Учалинский муниципальный район","80653000","муниципальный район"]
["Учалинский муниципальный район","Учалинский сельский совет","80653496","сельское поселение"]
["Федоровский муниципальный район","Бала-Четырманский сельский совет","80654405","сельское поселение"]
["Федоровский муниципальный район","Балыклинский сельский совет","80654410","сельское поселение"]
["Федоровский муниципальный район","Булякаевский сельский совет","80654415","сельское поселение"]
["Федоровский муниципальный район","Верхнеяушевский сельский совет","80654416","сельское поселение"]
["Федоровский муниципальный район","Гончаровский сельский совет","80654417","сельское поселение"]
["Федоровский муниципальный район","Дедовский сельский совет","80654420","сельское поселение"]
["Федоровский муниципальный район","Денискинский сельский совет","80654425","сельское поселение"]
["Федоровский муниципальный район","Каралачикский сельский совет","80654427","сельское поселение"]
["Федоровский муниципальный район","Михайловский сельский совет","80654430","сельское поселение"]
["Федоровский муниципальный район","Покровский сельский совет","80654440","сельское поселение"]
["Федоровский муниципальный район","Пугачевский сельский совет","80654445","сельское поселение"]
["Федоровский муниципальный район","Разинский сельский совет","80654450","сельское поселение"]
["Федоровский муниципальный район","Теняевский сельский совет","80654455","сельское поселение"]
["Федоровский муниципальный район","Федоровский муниципальный район","80654000","муниципальный район"]
["Федоровский муниципальный район","Федоровский сельский совет","80654460","сельское поселение"]
["Хайбуллинский муниципальный район","Абишевский сельский совет","80655405","сельское поселение"]
["Хайбуллинский муниципальный район","Акъюловский сельский совет","80655410","сельское поселение"]
["Хайбуллинский муниципальный район","Акъярский сельский совет","80655415","сельское поселение"]
["Хайбуллинский муниципальный район","Антинганский сельский совет","80655420","сельское поселение"]
["Хайбуллинский муниципальный район","Бурибайский сельский совет","80655424","сельское поселение"]
["Хайбуллинский муниципальный район","Ивановский сельский совет","80655425","сельское поселение"]
["Хайбуллинский муниципальный район","Маканский сельский совет","80655430","сельское поселение"]
["Хайбуллинский муниципальный район","Новозирганский сельский совет","80655432","сельское поселение"]
["Хайбуллинский муниципальный район","Самарский сельский совет","80655433","сельское поселение"]
["Хайбуллинский муниципальный район","Таналыкский сельский совет","80655440","сельское поселение"]
["Хайбуллинский муниципальный район","Татыр-Узякский сельский совет","80655435","сельское поселение"]
["Хайбуллинский муниципальный район","Уфимский сельский совет","80655445","сельское поселение"]
["Хайбуллинский муниципальный район","Федоровский сельский совет","80655450","сельское поселение"]
["Хайбуллинский муниципальный район","Хайбуллинский муниципальный район","80655000","муниципальный район"]
["Хайбуллинский муниципальный район","Целинный сельский совет","80655455","сельское поселение"]
["Чекмагушевский муниципальный район","Башировский сельский совет","80656410","сельское поселение"]
["Чекмагушевский муниципальный район","Имянликулевский сельский совет","80656415","сельское поселение"]
["Чекмагушевский муниципальный район","Калмашбашевский сельский совет","80656420","сельское поселение"]
["Чекмагушевский муниципальный район","Новобалтачевский сельский совет","80656425","сельское поселение"]
["Чекмагушевский муниципальный район","Новокутовский сельский совет","80656435","сельское поселение"]
["Чекмагушевский муниципальный район","Рапатовский сельский совет","80656440","сельское поселение"]
["Чекмагушевский муниципальный район","Резяповский сельский совет","80656445","сельское поселение"]
["Чекмагушевский муниципальный район","Старокалмашевский сельский совет","80656450","сельское поселение"]
["Чекмагушевский муниципальный район","Тайняшевский сельский совет","80656455","сельское поселение"]
["Чекмагушевский муниципальный район","Тузлукушевский сельский совет","80656460","сельское поселение"]
["Чекмагушевский муниципальный район","Урнякский сельский совет","80656465","сельское поселение"]
["Чекмагушевский муниципальный район","Чекмагушевский муниципальный район","80656000","муниципальный район"]
["Чекмагушевский муниципальный район","Чекмагушевский сельский совет","80656470","сельское поселение"]
["Чекмагушевский муниципальный район","Юмашевский сельский совет","80656475","сельское поселение"]
["Чишминский муниципальный район","Алкинский сельский совет","80657405","сельское поселение"]
["Чишминский муниципальный район","Аровский сельский совет","80657410","сельское поселение"]
["Чишминский муниципальный район","Арслановский сельский совет","80657415","сельское поселение"]
["Чишминский муниципальный район","Дмитриевский сельский совет","80657420","сельское поселение"]
["Чишминский муниципальный район","Дурасовский сельский совет","80657425","сельское поселение"]
["Чишминский муниципальный район","Енгалышевский сельский совет","80657430","сельское поселение"]
["Чишминский муниципальный район","Еремеевский сельский совет","80657435","сельское поселение"]
["Чишминский муниципальный район","Ибрагимовский сельский совет","80657440","сельское поселение"]
["Чишминский муниципальный район","Кара-Якуповский сельский совет","80657445","сельское поселение"]
["Чишминский муниципальный район","Лесной сельский совет","80657446","сельское поселение"]
["Чишминский муниципальный район","Новотроицкий сельский совет","80657450","сельское поселение"]
["Чишминский муниципальный район","Сафаровский сельский совет","80657455","сельское поселение"]
["Чишминский муниципальный район","Чишминский муниципальный район","80657000","муниципальный район"]
["Чишминский муниципальный район","Чишминский поссовет","80657151","городское поселение, в состав которого входит поселок"]
["Чишминский муниципальный район","Чишминский сельский совет","80657465","сельское поселение"]
["Чишминский муниципальный район","Чувалкиповский сельский совет","80657470","сельское поселение"]
["Чишминский муниципальный район","Шингак-Кульский сельский совет","80657475","сельское поселение"]
["Шаранский муниципальный район","Акбарисовский сельский совет","80658405","сельское поселение"]
["Шаранский муниципальный район","Базгиевский сельский совет","80658410","сельское поселение"]
["Шаранский муниципальный район","Дмитриево-Полянский сельский совет","80658415","сельское поселение"]
["Шаранский муниципальный район","Дюртюлинский сельский совет","80658420","сельское поселение"]
["Шаранский муниципальный район","Зириклинский сельский совет","80658425","сельское поселение"]
["Шаранский муниципальный район","Мичуринский сельский совет","80658430","сельское поселение"]
["Шаранский муниципальный район","Нижнезаитовский сельский совет","80658435","сельское поселение"]
["Шаранский муниципальный район","Нижнеташлинский сельский совет","80658440","сельское поселение"]
["Шаранский муниципальный район","Нуреевский сельский совет","80658445","сельское поселение"]
["Шаранский муниципальный район","Писаревский сельский совет","80658455","сельское поселение"]
["Шаранский муниципальный район","Старотумбагушевский сельский совет","80658465","сельское поселение"]
["Шаранский муниципальный район","Чалмалинский сельский совет","80658475","сельское поселение"]
["Шаранский муниципальный район","Шаранский муниципальный район","80658000","муниципальный район"]
["Шаранский муниципальный район","Шаранский сельский совет","80658485","сельское поселение"]
["Янаульский муниципальный район","Асавдыбашский сельский совет","80659410","сельское поселение"]
["Янаульский муниципальный район","Байгузинский сельский совет","80659415","сельское поселение"]
["Янаульский муниципальный район","Воядинский сельский совет","80659420","сельское поселение"]
["Янаульский муниципальный район","Город Янаул","80659101","городское поселение, в состав которого входит город"]
["Янаульский муниципальный район","Ижболдинский сельский совет","80659430","сельское поселение"]
["Янаульский муниципальный район","Истякский сельский совет","80659435","сельское поселение"]
["Янаульский муниципальный район","Иткинеевский сельский совет","80659440","сельское поселение"]
["Янаульский муниципальный район","Кармановский сельский совет","80659445","сельское поселение"]
["Янаульский муниципальный район","Кисак-Каинский сельский совет","80659450","сельское поселение"]
["Янаульский муниципальный район","Максимовский сельский совет","80659453","сельское поселение"]
["Янаульский муниципальный район","Месягутовский сельский совет","80659455","сельское поселение"]
["Янаульский муниципальный район","Новоартаульский сельский совет","80659460","сельское поселение"]
["Янаульский муниципальный район","Орловский сельский совет","80659465","сельское поселение"]
["Янаульский муниципальный район","Первомайский сельский совет","80659470","сельское поселение"]
["Янаульский муниципальный район","Сандугачевский сельский совет","80659475","сельское поселение"]
["Янаульский муниципальный район","Староваряшский сельский совет","80659480","сельское поселение"]
["Янаульский муниципальный район","Старокудашевский сельский совет","80659485","сельское поселение"]
["Янаульский муниципальный район","Шудекский сельский совет","80659490","сельское поселение"]
["Янаульский муниципальный район","Ямадинский сельский совет","80659495","сельское поселение"]
["Янаульский муниципальный район","Янаульский муниципальный район","80659000","муниципальный район"]

{"sheet":"AUTHORISATION","index":17,"n_rows":2,"n_cols":1,"rows_kept":2,"hidden":true}
["L1"]
["ACCESS GRANTED"]

{"sheet":"modInfo","index":18,"n_rows":3,"n_cols":2,"rows_kept":3,"hidden":true}
[]
[]
[null,"Нет доступных обновлений, версия отчёта актуальна"]

{"sheet":"modUIButtons","index":19,"n_rows":0,"n_cols":0,"rows_kept":0,"hidden":true}

{"sheet":"modVLDCommonProv","index":20,"n_rows":0,"n_cols":0,"rows_kept":0,"hidden":true}

{"sheet":"modVLDIntegrityProv","index":21,"n_rows":0,"n_cols":0,"rows_kept":0,"hidden":true}

{"sheet":"modVLDProv","index":22,"n_rows":0,"n_cols":0,"rows_kept":0,"hidden":true}

{"sheet":"modCommonProcedures","index":23,"n_rows":0,"n_cols":0,"rows_kept":0,"hidden":true}

{"sheet":"modfrmRegion","index":24,"n_rows":0,"n_cols":0,"rows_kept":0,"hidden":true}

{"sheet":"modVLDProvGeneralProc","index":25,"n_rows":0,"n_cols":0,"rows_kept":0,"hidden":true}

{"sheet":"modVLDOrgUniqueness","index":26,"n_rows":0,"n_cols":0,"rows_kept":0,"hidden":true}

{"sheet":"modfrmReestr","index":27,"n_rows":0,"n_cols":0,"rows_kept":0,"hidden":true}

{"sheet":"modUpdTemplMain","index":28,"n_rows":0,"n_cols":0,"rows_kept":0,"hidden":true}

{"sheet":"modfrmCheckUpdates","index":29,"n_rows":0,"n_cols":0,"rows_kept":0,"hidden":true}

{"sheet":"modGeneralProcedures","index":30,"n_rows":0,"n_cols":0,"rows_kept":0,"hidden":true}

{"sheet":"modRequestSpecificData","index":31,"n_rows":0,"n_cols":0,"rows_kept":0,"hidden":true}

{"sheet":"modRequestReestrData","index":32,"n_rows":0,"n_cols":0,"rows_kept":0,"hidden":true}

{"sheet":"modfrmDateChoose","index":33,"n_rows":0,"n_cols":0,"rows_kept":0,"hidden":true}

{"sheet":"modfrmReportMode","index":34,"n_rows":0,"n_cols":0,"rows_kept":0,"hidden":true}

{"sheet":"modListOrg","index":35,"n_rows":0,"n_cols":0,"rows_kept":0,"hidden":true}

{"sheet":"modLoad_Svod","index":36,"n_rows":1,"n_cols":2,"rows_kept":1,"hidden":true}
[null,"В указанной папке файлов не найдено!!!"]

{"sheet":"modOpen","index":37,"n_rows":0,"n_cols":0,"rows_kept":0,"hidden":true}